{"text_format":"1","workbook":"xlsx","n_sheets":17,"sheets":["How to","Cover","Female","Open","Male O40","Male O50","Female O35","Female U18","Male U18","Female U14","Male U14","Female U12","Male U12","Open doubles","Mix doubles","Female doubles","Junior doubles"],"not_rendered":{"charts":0,"images":2,"macros":0,"external_links":0,"defined_names":0,"comments":0,"pivot_tables":0},"unopened":[],"bounds":{"document_bytes":16777216,"sheet_cells":100000,"rows_first":2000,"rows_last":500,"rows_between":2000,"halvings":0,"cell_chars":16384,"cell_head_chars":4096},"cells_cut":0,"cells_raw":0,"read":"whole","date_system":"1900"}

{"sheet":"How to","index":0,"n_rows":21,"n_cols":2,"rows_kept":21,"cut":false,"hidden":false,"merged":[]}
[]
["How to fill this document ?"]
[]
["Cover sheet"]
[null,"Complete the tournament name."]
[null,"Set the correct number of points attributed to the winner."]
[null,"Fill in the date of the tournament."]
[null,"Fill in head organizer and head umpire names."]
[null,"If needed, customize the cover with sponsors' logo of the tournament."]
[]
["Division sheets"]
[null,"Set the number of participants, all ranks will be filled automatically."]
[null,"Fix tournament scheme if needed."]
[null,"Fill in players' surname and firstname as they appear in Ophardt database."]
[null,"Fill in the correct country using the trigraph as it appears in Ophardt database."]
[null,"For absent players, set rank to 900 and provide reason in “Reached stage” column.\nIf reason is not justified, player will get -100 points for no show."]
[]
["Finalize and send document"]
[null,"Remove all unplayed division sheets."]
[null,"Remove this 'How to' sheet."]
[null,"Send the editable document (not a pdf) to tournament@crossminton.org "]

{"sheet":"Cover","index":1,"n_rows":15,"n_cols":4,"rows_kept":15,"cut":false,"hidden":false,"merged":[[3,0,3,4],[5,1,5,3],[7,0,7,4],[14,0,14,1],[14,3,14,4]]}
[]
[]
[]
["ICO Speedminton® Sponsor – Country Open 2016"]
[null,null,"1000 points"]
[null,"Date"]
[]
["- Tournament results -"]
[]
[null,null,"Powered by"]
[]
[]
[]
[]
["Head umpire: NAME FirstName",null,null,"Head organizer: NAME FirstName"]

{"sheet":"Female","index":2,"n_rows":73,"n_cols":5,"rows_kept":73,"cut":false,"hidden":false,"merged":[[0,0,0,4]]}
["Female singles"]
[]
[null,"Number of players:",16]
[null,"Number of groups :",{"$f":"IF(C3<6,1,IF(C3<11,2,IF(C3=11,3,INT(C3/4))))","v":4}]
[null,"Tournament scheme:",{"$f":"CONCATENATE(IF(C3<6,CONCATENATE(\"1*\",C3),\"\"),IF(C3=6,\"2*3\",\"\"),IF(C3=7,\"1*4 + 1*3\",\"\"),IF(C3=11,\"2*4 + 1*3\",\"\"),IF(OR(C3=15,C3=10),CONCATENATE(C3/5,\"*5\"),\"\"),IF(OR(C3<=7,C3=10,C3=11,C3=15),\"\",CONCATENATE(INT(C3/4)-MOD(C3,4),\"*4\",IF(MOD(C3,4)=0,\"\",CONCATENATE(\" + \",MOD(C3,4),\"*5\")))))","v":"4*4"}]
[null,"Qualification:",{"$f":"IF(C3>=6,\"2 players per group\",\"NA\")","v":"2 players per group"}]
[null,"Nb of qualified players :",{"$f":"IF(C3<6,\"NA\",IF(C3<11,4,IF(C3=11,6,INT(C3/4)*2)))","v":8}]
[]
["Rank","Family name","First-name","Country","Reached stage"]
[1,null,null,null,{"$f":"IF(C$3<6,\"Group stage\",\"Final\")","v":"Final"}]
[2,null,null,null,"Final"]
[3,null,null,null,{"$f":"IF(C$3<6,\"Group stage\",\"1/2 final\")","v":"1/2 final"}]
[{"$f":"IF(C$3<6,4,3)","v":3},null,null,null,"1/2 final"]
[{"$f":"IF(C$3<5,\"\",5)","v":5},null,null,null,{"$f":"IF(C$3<5,\"\",IF(C$3=5,\"Group stage\",IF(C$7<5,\"3rd in group\",\"1/4 final\")))","v":"1/4 final"}]
[{"$f":"IF(C$3<6,\"\",5)","v":5},null,null,null,{"$f":"IF(C$3<6,\"\",IF(C$7<6,\"3rd in group\",\"1/4 final\"))","v":"1/4 final"}]
[{"$f":"IF(C$3<7,\"\",IF(C$7<7,IF(C$4+C$7>=7,C$7+1,C$7+C$4+1),5))","v":5},null,null,null,{"$f":"IF(C$3<7,\"\",IF(C$7<7,IF(C$4+C$7>=7,\"3rd in group\",\"Group stage\"),\"1/4 final\"))","v":"1/4 final"}]
[{"$f":"IF(C$3<8,\"\",IF(C$7<8,IF(C$4+C$7>=8,C$7+1,C$7+C$4+1),5))","v":5},null,null,null,{"$f":"IF(C$3<8,\"\",IF(C$7<8,IF(C$4+C$7>=8,\"3rd in group\",\"Group stage\"),\"1/4 final\"))","v":"1/4 final"}]
[{"$f":"IF(C$3<9,\"\",IF(C$7<9,IF(C$4+C$7>=9,C$7+1,C$7+C$4+1),9))","v":9},null,null,null,{"$f":"IF(C$3<9,\"\",IF(C$7<9,IF(C$4+C$7>=9,\"3rd in group\",\"Group stage\"),\"1/8 final\"))","v":"3rd in group"}]
[{"$f":"IF(C$3<10,\"\",IF(C$7<10,IF(C$4+C$7>=10,C$7+1,C$7+C$4+1),9))","v":9},null,null,null,{"$f":"IF(C$3<10,\"\",IF(C$7<10,IF(C$4+C$7>=10,\"3rd in group\",\"Group stage\"),\"1/8 final\"))","v":"3rd in group"}]
[{"$f":"IF(C$3<11,\"\",IF(C$7<11,IF(C$4+C$7>=11,C$7+1,C$7+C$4+1),9))","v":9},null,null,null,{"$f":"IF(C$3<11,\"\",IF(C$7<11,IF(C$4+C$7>=11,\"3rd in group\",\"Group stage\"),\"1/8 final\"))","v":"3rd in group"}]
[{"$f":"IF(C$3<12,\"\",IF(C$7<12,IF(C$4+C$7>=12,C$7+1,C$7+C$4+1),9))","v":9},null,null,null,{"$f":"IF(C$3<12,\"\",IF(C$7<12,IF(C$4+C$7>=12,\"3rd in group\",\"Group stage\"),\"1/8 final\"))","v":"3rd in group"}]
[{"$f":"IF(C$3<13,\"\",IF(C$7<13,IF(C$4+C$7>=13,C$7+1,C$7+C$4+1),9))","v":13},null,null,null,{"$f":"IF(C$3<13,\"\",IF(C$7<13,IF(C$4+C$7>=13,\"3rd in group\",\"Group stage\"),\"1/8 final\"))","v":"Group stage"}]
[{"$f":"IF(C$3<14,\"\",IF(C$7<14,IF(C$4+C$7>=14,C$7+1,C$7+C$4+1),9))","v":13},null,null,null,{"$f":"IF(C$3<14,\"\",IF(C$7<14,IF(C$4+C$7>=14,\"3rd in group\",\"Group stage\"),\"1/8 final\"))","v":"Group stage"}]
[{"$f":"IF(C$3<15,\"\",IF(C$7<15,IF(C$4+C$7>=15,C$7+1,C$7+C$4+1),9))","v":13},null,null,null,{"$f":"IF(C$3<15,\"\",IF(C$7<15,IF(C$4+C$7>=15,\"3rd in group\",\"Group stage\"),\"1/8 final\"))","v":"Group stage"}]
[{"$f":"IF(C$3<16,\"\",IF(C$7<16,IF(C$4+C$7>=16,C$7+1,C$7+C$4+1),9))","v":13},null,null,null,{"$f":"IF(C$3<16,\"\",IF(C$7<16,IF(C$4+C$7>=16,\"3rd in group\",\"Group stage\"),\"1/8 final\"))","v":"Group stage"}]
[{"$f":"IF(C$3<17,\"\",IF(C$7<17,IF(C$4+C$7>=17,C$7+1,C$7+C$4+1),17))","v":""},null,null,null,{"$f":"IF(C$3<17,\"\",IF(C$7<17,IF(C$4+C$7>=17,\"3rd in group\",\"Group stage\"),\"1/16 final\"))","v":""}]
[{"$f":"IF(C$3<18,\"\",IF(C$7<18,IF(C$4+C$7>=18,C$7+1,C$7+C$4+1),17))","v":""},null,null,null,{"$f":"IF(C$3<18,\"\",IF(C$7<18,IF(C$4+C$7>=18,\"3rd in group\",\"Group stage\"),\"1/16 final\"))","v":""}]
[{"$f":"IF(C$3<19,\"\",IF(C$7<19,IF(C$4+C$7>=19,C$7+1,C$7+C$4+1),17))","v":""},null,null,null,{"$f":"IF(C$3<19,\"\",IF(C$7<19,IF(C$4+C$7>=19,\"3rd in group\",\"Group stage\"),\"1/16 final\"))","v":""}]
[{"$f":"IF(C$3<20,\"\",IF(C$7<20,IF(C$4+C$7>=20,C$7+1,C$7+C$4+1),17))","v":""},null,null,null,{"$f":"IF(C$3<20,\"\",IF(C$7<20,IF(C$4+C$7>=20,\"3rd in group\",\"Group stage\"),\"1/16 final\"))","v":""}]
[{"$f":"IF(C$3<21,\"\",IF(C$7<21,IF(C$4+C$7>=21,C$7+1,C$7+C$4+1),17))","v":""},null,null,null,{"$f":"IF(C$3<21,\"\",IF(C$7<21,IF(C$4+C$7>=21,\"3rd in group\",\"Group stage\"),\"1/16 final\"))","v":""}]
[{"$f":"IF(C$3<22,\"\",IF(C$7<22,IF(C$4+C$7>=22,C$7+1,C$7+C$4+1),17))","v":""},null,null,null,{"$f":"IF(C$3<22,\"\",IF(C$7<22,IF(C$4+C$7>=22,\"3rd in group\",\"Group stage\"),\"1/16 final\"))","v":""}]
[{"$f":"IF(C$3<23,\"\",IF(C$7<23,IF(C$4+C$7>=23,C$7+1,C$7+C$4+1),17))","v":""},null,null,null,{"$f":"IF(C$3<23,\"\",IF(C$7<23,IF(C$4+C$7>=23,\"3rd in group\",\"Group stage\"),\"1/16 final\"))","v":""}]
[{"$f":"IF(C$3<24,\"\",IF(C$7<24,IF(C$4+C$7>=24,C$7+1,C$7+C$4+1),17))","v":""},null,null,null,{"$f":"IF(C$3<24,\"\",IF(C$7<24,IF(C$4+C$7>=24,\"3rd in group\",\"Group stage\"),\"1/16 final\"))","v":""}]
[{"$f":"IF(C$3<25,\"\",IF(C$7<25,IF(C$4+C$7>=25,C$7+1,C$7+C$4+1),17))","v":""},null,null,null,{"$f":"IF(C$3<25,\"\",IF(C$7<25,IF(C$4+C$7>=25,\"3rd in group\",\"Group stage\"),\"1/16 final\"))","v":""}]
[{"$f":"IF(C$3<26,\"\",IF(C$7<26,IF(C$4+C$7>=26,C$7+1,C$7+C$4+1),17))","v":""},null,null,null,{"$f":"IF(C$3<26,\"\",IF(C$7<26,IF(C$4+C$7>=26,\"3rd in group\",\"Group stage\"),\"1/16 final\"))","v":""}]
[{"$f":"IF(C$3<27,\"\",IF(C$7<27,IF(C$4+C$7>=27,C$7+1,C$7+C$4+1),17))","v":""},null,null,null,{"$f":"IF(C$3<27,\"\",IF(C$7<27,IF(C$4+C$7>=27,\"3rd in group\",\"Group stage\"),\"1/16 final\"))","v":""}]
[{"$f":"IF(C$3<28,\"\",IF(C$7<28,IF(C$4+C$7>=28,C$7+1,C$7+C$4+1),17))","v":""},null,null,null,{"$f":"IF(C$3<28,\"\",IF(C$7<28,IF(C$4+C$7>=28,\"3rd in group\",\"Group stage\"),\"1/16 final\"))","v":""}]
[{"$f":"IF(C$3<29,\"\",IF(C$7<29,IF(C$4+C$7>=29,C$7+1,C$7+C$4+1),17))","v":""},null,null,null,{"$f":"IF(C$3<29,\"\",IF(C$7<29,IF(C$4+C$7>=29,\"3rd in group\",\"Group stage\"),\"1/16 final\"))","v":""}]
[{"$f":"IF(C$3<30,\"\",IF(C$7<30,IF(C$4+C$7>=30,C$7+1,C$7+C$4+1),17))","v":""},null,null,null,{"$f":"IF(C$3<30,\"\",IF(C$7<30,IF(C$4+C$7>=30,\"3rd in group\",\"Group stage\"),\"1/16 final\"))","v":""}]
[{"$f":"IF(C$3<31,\"\",IF(C$7<31,IF(C$4+C$7>=31,C$7+1,C$7+C$4+1),17))","v":""},null,null,null,{"$f":"IF(C$3<31,\"\",IF(C$7<31,IF(C$4+C$7>=31,\"3rd in group\",\"Group stage\"),\"1/16 final\"))","v":""}]
[{"$f":"IF(C$3<32,\"\",IF(C$7<32,IF(C$4+C$7>=32,C$7+1,C$7+C$4+1),17))","v":""},null,null,null,{"$f":"IF(C$3<32,\"\",IF(C$7<32,IF(C$4+C$7>=32,\"3rd in group\",\"Group stage\"),\"1/16 final\"))","v":""}]
[{"$f":"IF(C$3<33,\"\",IF(C$7<33,IF(C$4+C$7>=33,C$7+1,C$7+C$4+1),33))","v":""},null,null,null,{"$f":"IF(C$3<33,\"\",IF(C$7<33,IF(C$4+C$7>=33,\"3rd in group\",\"Group stage\"),\"1/32 final\"))","v":""}]
[{"$f":"IF(C$3<34,\"\",IF(C$7<34,IF(C$4+C$7>=34,C$7+1,C$7+C$4+1),33))","v":""},null,null,null,{"$f":"IF(C$3<34,\"\",IF(C$7<34,IF(C$4+C$7>=34,\"3rd in group\",\"Group stage\"),\"1/32 final\"))","v":""}]
[{"$f":"IF(C$3<35,\"\",IF(C$7<35,IF(C$4+C$7>=35,C$7+1,C$7+C$4+1),33))","v":""},null,null,null,{"$f":"IF(C$3<35,\"\",IF(C$7<35,IF(C$4+C$7>=35,\"3rd in group\",\"Group stage\"),\"1/32 final\"))","v":""}]
[{"$f":"IF(C$3<36,\"\",IF(C$7<36,IF(C$4+C$7>=36,C$7+1,C$7+C$4+1),33))","v":""},null,null,null,{"$f":"IF(C$3<36,\"\",IF(C$7<36,IF(C$4+C$7>=36,\"3rd in group\",\"Group stage\"),\"1/32 final\"))","v":""}]
[{"$f":"IF(C$3<37,\"\",IF(C$7<37,IF(C$4+C$7>=37,C$7+1,C$7+C$4+1),33))","v":""},null,null,null,{"$f":"IF(C$3<37,\"\",IF(C$7<37,IF(C$4+C$7>=37,\"3rd in group\",\"Group stage\"),\"1/32 final\"))","v":""}]
[{"$f":"IF(C$3<38,\"\",IF(C$7<38,IF(C$4+C$7>=38,C$7+1,C$7+C$4+1),33))","v":""},null,null,null,{"$f":"IF(C$3<38,\"\",IF(C$7<38,IF(C$4+C$7>=38,\"3rd in group\",\"Group stage\"),\"1/32 final\"))","v":""}]
[{"$f":"IF(C$3<39,\"\",IF(C$7<39,IF(C$4+C$7>=39,C$7+1,C$7+C$4+1),33))","v":""},null,null,null,{"$f":"IF(C$3<39,\"\",IF(C$7<39,IF(C$4+C$7>=39,\"3rd in group\",\"Group stage\"),\"1/32 final\"))","v":""}]
[{"$f":"IF(C$3<40,\"\",IF(C$7<40,IF(C$4+C$7>=40,C$7+1,C$7+C$4+1),33))","v":""},null,null,null,{"$f":"IF(C$3<40,\"\",IF(C$7<40,IF(C$4+C$7>=40,\"3rd in group\",\"Group stage\"),\"1/32 final\"))","v":""}]
[{"$f":"IF(C$3<41,\"\",IF(C$7<41,IF(C$4+C$7>=41,C$7+1,C$7+C$4+1),33))","v":""},null,null,null,{"$f":"IF(C$3<41,\"\",IF(C$7<41,IF(C$4+C$7>=41,\"3rd in group\",\"Group stage\"),\"1/32 final\"))","v":""}]
[{"$f":"IF(C$3<42,\"\",IF(C$7<42,IF(C$4+C$7>=42,C$7+1,C$7+C$4+1),33))","v":""},null,null,null,{"$f":"IF(C$3<42,\"\",IF(C$7<42,IF(C$4+C$7>=42,\"3rd in group\",\"Group stage\"),\"1/32 final\"))","v":""}]
[{"$f":"IF(C$3<43,\"\",IF(C$7<43,IF(C$4+C$7>=43,C$7+1,C$7+C$4+1),33))","v":""},null,null,null,{"$f":"IF(C$3<43,\"\",IF(C$7<43,IF(C$4+C$7>=43,\"3rd in group\",\"Group stage\"),\"1/32 final\"))","v":""}]
[{"$f":"IF(C$3<44,\"\",IF(C$7<44,IF(C$4+C$7>=44,C$7+1,C$7+C$4+1),33))","v":""},null,null,null,{"$f":"IF(C$3<44,\"\",IF(C$7<44,IF(C$4+C$7>=44,\"3rd in group\",\"Group stage\"),\"1/32 final\"))","v":""}]
[{"$f":"IF(C$3<45,\"\",IF(C$7<45,IF(C$4+C$7>=45,C$7+1,C$7+C$4+1),33))","v":""},null,null,null,{"$f":"IF(C$3<45,\"\",IF(C$7<45,IF(C$4+C$7>=45,\"3rd in group\",\"Group stage\"),\"1/32 final\"))","v":""}]
[{"$f":"IF(C$3<46,\"\",IF(C$7<46,IF(C$4+C$7>=46,C$7+1,C$7+C$4+1),33))","v":""},null,null,null,{"$f":"IF(C$3<46,\"\",IF(C$7<46,IF(C$4+C$7>=46,\"3rd in group\",\"Group stage\"),\"1/32 final\"))","v":""}]
[{"$f":"IF(C$3<47,\"\",IF(C$7<47,IF(C$4+C$7>=47,C$7+1,C$7+C$4+1),33))","v":""},null,null,null,{"$f":"IF(C$3<47,\"\",IF(C$7<47,IF(C$4+C$7>=47,\"3rd in group\",\"Group stage\"),\"1/32 final\"))","v":""}]
[{"$f":"IF(C$3<48,\"\",IF(C$7<48,IF(C$4+C$7>=48,C$7+1,C$7+C$4+1),33))","v":""},null,null,null,{"$f":"IF(C$3<48,\"\",IF(C$7<48,IF(C$4+C$7>=48,\"3rd in group\",\"Group stage\"),\"1/32 final\"))","v":""}]
[{"$f":"IF(C$3<49,\"\",IF(C$7<49,IF(C$4+C$7>=49,C$7+1,C$7+C$4+1),33))","v":""},null,null,null,{"$f":"IF(C$3<49,\"\",IF(C$7<49,IF(C$4+C$7>=49,\"3rd in group\",\"Group stage\"),\"1/32 final\"))","v":""}]
[{"$f":"IF(C$3<50,\"\",IF(C$7<50,IF(C$4+C$7>=50,C$7+1,C$7+C$4+1),33))","v":""},null,null,null,{"$f":"IF(C$3<50,\"\",IF(C$7<50,IF(C$4+C$7>=50,\"3rd in group\",\"Group stage\"),\"1/32 final\"))","v":""}]
[{"$f":"IF(C$3<51,\"\",IF(C$7<51,IF(C$4+C$7>=51,C$7+1,C$7+C$4+1),33))","v":""},null,null,null,{"$f":"IF(C$3<51,\"\",IF(C$7<51,IF(C$4+C$7>=51,\"3rd in group\",\"Group stage\"),\"1/32 final\"))","v":""}]
[{"$f":"IF(C$3<52,\"\",IF(C$7<52,IF(C$4+C$7>=52,C$7+1,C$7+C$4+1),33))","v":""},null,null,null,{"$f":"IF(C$3<52,\"\",IF(C$7<52,IF(C$4+C$7>=52,\"3rd in group\",\"Group stage\"),\"1/32 final\"))","v":""}]
[{"$f":"IF(C$3<53,\"\",IF(C$7<53,IF(C$4+C$7>=53,C$7+1,C$7+C$4+1),33))","v":""},null,null,null,{"$f":"IF(C$3<53,\"\",IF(C$7<53,IF(C$4+C$7>=53,\"3rd in group\",\"Group stage\"),\"1/32 final\"))","v":""}]
[{"$f":"IF(C$3<54,\"\",IF(C$7<54,IF(C$4+C$7>=54,C$7+1,C$7+C$4+1),33))","v":""},null,null,null,{"$f":"IF(C$3<54,\"\",IF(C$7<54,IF(C$4+C$7>=54,\"3rd in group\",\"Group stage\"),\"1/32 final\"))","v":""}]
[{"$f":"IF(C$3<55,\"\",IF(C$7<55,IF(C$4+C$7>=55,C$7+1,C$7+C$4+1),33))","v":""},null,null,null,{"$f":"IF(C$3<55,\"\",IF(C$7<55,IF(C$4+C$7>=55,\"3rd in group\",\"Group stage\"),\"1/32 final\"))","v":""}]
[{"$f":"IF(C$3<56,\"\",IF(C$7<56,IF(C$4+C$7>=56,C$7+1,C$7+C$4+1),33))","v":""},null,null,null,{"$f":"IF(C$3<56,\"\",IF(C$7<56,IF(C$4+C$7>=56,\"3rd in group\",\"Group stage\"),\"1/32 final\"))","v":""}]
[{"$f":"IF(C$3<57,\"\",IF(C$7<57,IF(C$4+C$7>=57,C$7+1,C$7+C$4+1),33))","v":""},null,null,null,{"$f":"IF(C$3<57,\"\",IF(C$7<57,IF(C$4+C$7>=57,\"3rd in group\",\"Group stage\"),\"1/32 final\"))","v":""}]
[{"$f":"IF(C$3<58,\"\",IF(C$7<58,IF(C$4+C$7>=58,C$7+1,C$7+C$4+1),33))","v":""},null,null,null,{"$f":"IF(C$3<58,\"\",IF(C$7<58,IF(C$4+C$7>=58,\"3rd in group\",\"Group stage\"),\"1/32 final\"))","v":""}]
[{"$f":"IF(C$3<59,\"\",IF(C$7<59,IF(C$4+C$7>=59,C$7+1,C$7+C$4+1),33))","v":""},null,null,null,{"$f":"IF(C$3<59,\"\",IF(C$7<59,IF(C$4+C$7>=59,\"3rd in group\",\"Group stage\"),\"1/32 final\"))","v":""}]
[{"$f":"IF(C$3<60,\"\",IF(C$7<60,IF(C$4+C$7>=60,C$7+1,C$7+C$4+1),33))","v":""},null,null,null,{"$f":"IF(C$3<60,\"\",IF(C$7<60,IF(C$4+C$7>=60,\"3rd in group\",\"Group stage\"),\"1/32 final\"))","v":""}]
[{"$f":"IF(C$3<61,\"\",IF(C$7<61,IF(C$4+C$7>=61,C$7+1,C$7+C$4+1),33))","v":""},null,null,null,{"$f":"IF(C$3<61,\"\",IF(C$7<61,IF(C$4+C$7>=61,\"3rd in group\",\"Group stage\"),\"1/32 final\"))","v":""}]
[{"$f":"IF(C$3<62,\"\",IF(C$7<62,IF(C$4+C$7>=62,C$7+1,C$7+C$4+1),33))","v":""},null,null,null,{"$f":"IF(C$3<62,\"\",IF(C$7<62,IF(C$4+C$7>=62,\"3rd in group\",\"Group stage\"),\"1/32 final\"))","v":""}]
[{"$f":"IF(C$3<63,\"\",IF(C$7<63,IF(C$4+C$7>=63,C$7+1,C$7+C$4+1),33))","v":""},null,null,null,{"$f":"IF(C$3<63,\"\",IF(C$7<63,IF(C$4+C$7>=63,\"3rd in group\",\"Group stage\"),\"1/32 final\"))","v":""}]
[{"$f":"IF(C$3<64,\"\",IF(C$7<64,IF(C$4+C$7>=64,C$7+1,C$7+C$4+1),33))","v":""},null,null,null,{"$f":"IF(C$3<64,\"\",IF(C$7<64,IF(C$4+C$7>=64,\"3rd in group\",\"Group stage\"),\"1/32 final\"))","v":""}]

{"sheet":"Open","index":3,"n_rows":73,"n_cols":5,"rows_kept":73,"cut":false,"hidden":false,"merged":[[0,0,0,4]]}
["Open singles (all genders)"]
[]
[null,"Number of players:",16]
[null,"Number of groups :",{"$f":"IF(C3<6,1,IF(C3<11,2,IF(C3=11,3,INT(C3/4))))","v":4}]
[null,"Tournament scheme:",{"$f":"CONCATENATE(IF(C3<6,CONCATENATE(\"1*\",C3),\"\"),IF(C3=6,\"2*3\",\"\"),IF(C3=7,\"1*4 + 1*3\",\"\"),IF(C3=11,\"2*4 + 1*3\",\"\"),IF(OR(C3=15,C3=10),CONCATENATE(C3/5,\"*5\"),\"\"),IF(OR(C3<=7,C3=10,C3=11,C3=15),\"\",CONCATENATE(INT(C3/4)-MOD(C3,4),\"*4\",IF(MOD(C3,4)=0,\"\",CONCATENATE(\" + \",MOD(C3,4),\"*5\")))))","v":"4*4"}]
[null,"Qualification:",{"$f":"IF(C3>=6,\"2 players per group\",\"NA\")","v":"2 players per group"}]
[null,"Nb of qualified players :",{"$f":"IF(C3<6,\"NA\",IF(C3<11,4,IF(C3=11,6,INT(C3/4)*2)))","v":8}]
[]
["Rank","Family name","First-name","Country","Reached stage"]
[1,null,null,null,{"$f":"IF(C$3<6,\"Group stage\",\"Final\")","v":"Final"}]
[2,null,null,null,"Final"]
[3,null,null,null,{"$f":"IF(C$3<6,\"Group stage\",\"1/2 final\")","v":"1/2 final"}]
[{"$f":"IF(C$3<6,4,3)","v":3},null,null,null,"1/2 final"]
[{"$f":"IF(C$3<5,\"\",5)","v":5},null,null,null,{"$f":"IF(C$3<5,\"\",IF(C$3=5,\"Group stage\",IF(C$7<5,\"3rd in group\",\"1/4 final\")))","v":"1/4 final"}]
[{"$f":"IF(C$3<6,\"\",5)","v":5},null,null,null,{"$f":"IF(C$3<6,\"\",IF(C$7<6,\"3rd in group\",\"1/4 final\"))","v":"1/4 final"}]
[{"$f":"IF(C$3<7,\"\",IF(C$7<7,IF(C$4+C$7>=7,C$7+1,C$7+C$4+1),5))","v":5},null,null,null,{"$f":"IF(C$3<7,\"\",IF(C$7<7,IF(C$4+C$7>=7,\"3rd in group\",\"Group stage\"),\"1/4 final\"))","v":"1/4 final"}]
[{"$f":"IF(C$3<8,\"\",IF(C$7<8,IF(C$4+C$7>=8,C$7+1,C$7+C$4+1),5))","v":5},null,null,null,{"$f":"IF(C$3<8,\"\",IF(C$7<8,IF(C$4+C$7>=8,\"3rd in group\",\"Group stage\"),\"1/4 final\"))","v":"1/4 final"}]
[{"$f":"IF(C$3<9,\"\",IF(C$7<9,IF(C$4+C$7>=9,C$7+1,C$7+C$4+1),9))","v":9},null,null,null,{"$f":"IF(C$3<9,\"\",IF(C$7<9,IF(C$4+C$7>=9,\"3rd in group\",\"Group stage\"),\"1/8 final\"))","v":"3rd in group"}]
[{"$f":"IF(C$3<10,\"\",IF(C$7<10,IF(C$4+C$7>=10,C$7+1,C$7+C$4+1),9))","v":9},null,null,null,{"$f":"IF(C$3<10,\"\",IF(C$7<10,IF(C$4+C$7>=10,\"3rd in group\",\"Group stage\"),\"1/8 final\"))","v":"3rd in group"}]
[{"$f":"IF(C$3<11,\"\",IF(C$7<11,IF(C$4+C$7>=11,C$7+1,C$7+C$4+1),9))","v":9},null,null,null,{"$f":"IF(C$3<11,\"\",IF(C$7<11,IF(C$4+C$7>=11,\"3rd in group\",\"Group stage\"),\"1/8 final\"))","v":"3rd in group"}]
[{"$f":"IF(C$3<12,\"\",IF(C$7<12,IF(C$4+C$7>=12,C$7+1,C$7+C$4+1),9))","v":9},null,null,null,{"$f":"IF(C$3<12,\"\",IF(C$7<12,IF(C$4+C$7>=12,\"3rd in group\",\"Group stage\"),\"1/8 final\"))","v":"3rd in group"}]
[{"$f":"IF(C$3<13,\"\",IF(C$7<13,IF(C$4+C$7>=13,C$7+1,C$7+C$4+1),9))","v":13},null,null,null,{"$f":"IF(C$3<13,\"\",IF(C$7<13,IF(C$4+C$7>=13,\"3rd in group\",\"Group stage\"),\"1/8 final\"))","v":"Group stage"}]
[{"$f":"IF(C$3<14,\"\",IF(C$7<14,IF(C$4+C$7>=14,C$7+1,C$7+C$4+1),9))","v":13},null,null,null,{"$f":"IF(C$3<14,\"\",IF(C$7<14,IF(C$4+C$7>=14,\"3rd in group\",\"Group stage\"),\"1/8 final\"))","v":"Group stage"}]
[{"$f":"IF(C$3<15,\"\",IF(C$7<15,IF(C$4+C$7>=15,C$7+1,C$7+C$4+1),9))","v":13},null,null,null,{"$f":"IF(C$3<15,\"\",IF(C$7<15,IF(C$4+C$7>=15,\"3rd in group\",\"Group stage\"),\"1/8 final\"))","v":"Group stage"}]
[{"$f":"IF(C$3<16,\"\",IF(C$7<16,IF(C$4+C$7>=16,C$7+1,C$7+C$4+1),9))","v":13},null,null,null,{"$f":"IF(C$3<16,\"\",IF(C$7<16,IF(C$4+C$7>=16,\"3rd in group\",\"Group stage\"),\"1/8 final\"))","v":"Group stage"}]
[{"$f":"IF(C$3<17,\"\",IF(C$7<17,IF(C$4+C$7>=17,C$7+1,C$7+C$4+1),17))","v":""},null,null,null,{"$f":"IF(C$3<17,\"\",IF(C$7<17,IF(C$4+C$7>=17,\"3rd in group\",\"Group stage\"),\"1/16 final\"))","v":""}]
[{"$f":"IF(C$3<18,\"\",IF(C$7<18,IF(C$4+C$7>=18,C$7+1,C$7+C$4+1),17))","v":""},null,null,null,{"$f":"IF(C$3<18,\"\",IF(C$7<18,IF(C$4+C$7>=18,\"3rd in group\",\"Group stage\"),\"1/16 final\"))","v":""}]
[{"$f":"IF(C$3<19,\"\",IF(C$7<19,IF(C$4+C$7>=19,C$7+1,C$7+C$4+1),17))","v":""},null,null,null,{"$f":"IF(C$3<19,\"\",IF(C$7<19,IF(C$4+C$7>=19,\"3rd in group\",\"Group stage\"),\"1/16 final\"))","v":""}]
[{"$f":"IF(C$3<20,\"\",IF(C$7<20,IF(C$4+C$7>=20,C$7+1,C$7+C$4+1),17))","v":""},null,null,null,{"$f":"IF(C$3<20,\"\",IF(C$7<20,IF(C$4+C$7>=20,\"3rd in group\",\"Group stage\"),\"1/16 final\"))","v":""}]
[{"$f":"IF(C$3<21,\"\",IF(C$7<21,IF(C$4+C$7>=21,C$7+1,C$7+C$4+1),17))","v":""},null,null,null,{"$f":"IF(C$3<21,\"\",IF(C$7<21,IF(C$4+C$7>=21,\"3rd in group\",\"Group stage\"),\"1/16 final\"))","v":""}]
[{"$f":"IF(C$3<22,\"\",IF(C$7<22,IF(C$4+C$7>=22,C$7+1,C$7+C$4+1),17))","v":""},null,null,null,{"$f":"IF(C$3<22,\"\",IF(C$7<22,IF(C$4+C$7>=22,\"3rd in group\",\"Group stage\"),\"1/16 final\"))","v":""}]
[{"$f":"IF(C$3<23,\"\",IF(C$7<23,IF(C$4+C$7>=23,C$7+1,C$7+C$4+1),17))","v":""},null,null,null,{"$f":"IF(C$3<23,\"\",IF(C$7<23,IF(C$4+C$7>=23,\"3rd in group\",\"Group stage\"),\"1/16 final\"))","v":""}]
[{"$f":"IF(C$3<24,\"\",IF(C$7<24,IF(C$4+C$7>=24,C$7+1,C$7+C$4+1),17))","v":""},null,null,null,{"$f":"IF(C$3<24,\"\",IF(C$7<24,IF(C$4+C$7>=24,\"3rd in group\",\"Group stage\"),\"1/16 final\"))","v":""}]
[{"$f":"IF(C$3<25,\"\",IF(C$7<25,IF(C$4+C$7>=25,C$7+1,C$7+C$4+1),17))","v":""},null,null,null,{"$f":"IF(C$3<25,\"\",IF(C$7<25,IF(C$4+C$7>=25,\"3rd in group\",\"Group stage\"),\"1/16 final\"))","v":""}]
[{"$f":"IF(C$3<26,\"\",IF(C$7<26,IF(C$4+C$7>=26,C$7+1,C$7+C$4+1),17))","v":""},null,null,null,{"$f":"IF(C$3<26,\"\",IF(C$7<26,IF(C$4+C$7>=26,\"3rd in group\",\"Group stage\"),\"1/16 final\"))","v":""}]
[{"$f":"IF(C$3<27,\"\",IF(C$7<27,IF(C$4+C$7>=27,C$7+1,C$7+C$4+1),17))","v":""},null,null,null,{"$f":"IF(C$3<27,\"\",IF(C$7<27,IF(C$4+C$7>=27,\"3rd in group\",\"Group stage\"),\"1/16 final\"))","v":""}]
[{"$f":"IF(C$3<28,\"\",IF(C$7<28,IF(C$4+C$7>=28,C$7+1,C$7+C$4+1),17))","v":""},null,null,null,{"$f":"IF(C$3<28,\"\",IF(C$7<28,IF(C$4+C$7>=28,\"3rd in group\",\"Group stage\"),\"1/16 final\"))","v":""}]
[{"$f":"IF(C$3<29,\"\",IF(C$7<29,IF(C$4+C$7>=29,C$7+1,C$7+C$4+1),17))","v":""},null,null,null,{"$f":"IF(C$3<29,\"\",IF(C$7<29,IF(C$4+C$7>=29,\"3rd in group\",\"Group stage\"),\"1/16 final\"))","v":""}]
[{"$f":"IF(C$3<30,\"\",IF(C$7<30,IF(C$4+C$7>=30,C$7+1,C$7+C$4+1),17))","v":""},null,null,null,{"$f":"IF(C$3<30,\"\",IF(C$7<30,IF(C$4+C$7>=30,\"3rd in group\",\"Group stage\"),\"1/16 final\"))","v":""}]
[{"$f":"IF(C$3<31,\"\",IF(C$7<31,IF(C$4+C$7>=31,C$7+1,C$7+C$4+1),17))","v":""},null,null,null,{"$f":"IF(C$3<31,\"\",IF(C$7<31,IF(C$4+C$7>=31,\"3rd in group\",\"Group stage\"),\"1/16 final\"))","v":""}]
[{"$f":"IF(C$3<32,\"\",IF(C$7<32,IF(C$4+C$7>=32,C$7+1,C$7+C$4+1),17))","v":""},null,null,null,{"$f":"IF(C$3<32,\"\",IF(C$7<32,IF(C$4+C$7>=32,\"3rd in group\",\"Group stage\"),\"1/16 final\"))","v":""}]
[{"$f":"IF(C$3<33,\"\",IF(C$7<33,IF(C$4+C$7>=33,C$7+1,C$7+C$4+1),33))","v":""},null,null,null,{"$f":"IF(C$3<33,\"\",IF(C$7<33,IF(C$4+C$7>=33,\"3rd in group\",\"Group stage\"),\"1/32 final\"))","v":""}]
[{"$f":"IF(C$3<34,\"\",IF(C$7<34,IF(C$4+C$7>=34,C$7+1,C$7+C$4+1),33))","v":""},null,null,null,{"$f":"IF(C$3<34,\"\",IF(C$7<34,IF(C$4+C$7>=34,\"3rd in group\",\"Group stage\"),\"1/32 final\"))","v":""}]
[{"$f":"IF(C$3<35,\"\",IF(C$7<35,IF(C$4+C$7>=35,C$7+1,C$7+C$4+1),33))","v":""},null,null,null,{"$f":"IF(C$3<35,\"\",IF(C$7<35,IF(C$4+C$7>=35,\"3rd in group\",\"Group stage\"),\"1/32 final\"))","v":""}]
[{"$f":"IF(C$3<36,\"\",IF(C$7<36,IF(C$4+C$7>=36,C$7+1,C$7+C$4+1),33))","v":""},null,null,null,{"$f":"IF(C$3<36,\"\",IF(C$7<36,IF(C$4+C$7>=36,\"3rd in group\",\"Group stage\"),\"1/32 final\"))","v":""}]
[{"$f":"IF(C$3<37,\"\",IF(C$7<37,IF(C$4+C$7>=37,C$7+1,C$7+C$4+1),33))","v":""},null,null,null,{"$f":"IF(C$3<37,\"\",IF(C$7<37,IF(C$4+C$7>=37,\"3rd in group\",\"Group stage\"),\"1/32 final\"))","v":""}]
[{"$f":"IF(C$3<38,\"\",IF(C$7<38,IF(C$4+C$7>=38,C$7+1,C$7+C$4+1),33))","v":""},null,null,null,{"$f":"IF(C$3<38,\"\",IF(C$7<38,IF(C$4+C$7>=38,\"3rd in group\",\"Group stage\"),\"1/32 final\"))","v":""}]
[{"$f":"IF(C$3<39,\"\",IF(C$7<39,IF(C$4+C$7>=39,C$7+1,C$7+C$4+1),33))","v":""},null,null,null,{"$f":"IF(C$3<39,\"\",IF(C$7<39,IF(C$4+C$7>=39,\"3rd in group\",\"Group stage\"),\"1/32 final\"))","v":""}]
[{"$f":"IF(C$3<40,\"\",IF(C$7<40,IF(C$4+C$7>=40,C$7+1,C$7+C$4+1),33))","v":""},null,null,null,{"$f":"IF(C$3<40,\"\",IF(C$7<40,IF(C$4+C$7>=40,\"3rd in group\",\"Group stage\"),\"1/32 final\"))","v":""}]
[{"$f":"IF(C$3<41,\"\",IF(C$7<41,IF(C$4+C$7>=41,C$7+1,C$7+C$4+1),33))","v":""},null,null,null,{"$f":"IF(C$3<41,\"\",IF(C$7<41,IF(C$4+C$7>=41,\"3rd in group\",\"Group stage\"),\"1/32 final\"))","v":""}]
[{"$f":"IF(C$3<42,\"\",IF(C$7<42,IF(C$4+C$7>=42,C$7+1,C$7+C$4+1),33))","v":""},null,null,null,{"$f":"IF(C$3<42,\"\",IF(C$7<42,IF(C$4+C$7>=42,\"3rd in group\",\"Group stage\"),\"1/32 final\"))","v":""}]
[{"$f":"IF(C$3<43,\"\",IF(C$7<43,IF(C$4+C$7>=43,C$7+1,C$7+C$4+1),33))","v":""},null,null,null,{"$f":"IF(C$3<43,\"\",IF(C$7<43,IF(C$4+C$7>=43,\"3rd in group\",\"Group stage\"),\"1/32 final\"))","v":""}]
[{"$f":"IF(C$3<44,\"\",IF(C$7<44,IF(C$4+C$7>=44,C$7+1,C$7+C$4+1),33))","v":""},null,null,null,{"$f":"IF(C$3<44,\"\",IF(C$7<44,IF(C$4+C$7>=44,\"3rd in group\",\"Group stage\"),\"1/32 final\"))","v":""}]
[{"$f":"IF(C$3<45,\"\",IF(C$7<45,IF(C$4+C$7>=45,C$7+1,C$7+C$4+1),33))","v":""},null,null,null,{"$f":"IF(C$3<45,\"\",IF(C$7<45,IF(C$4+C$7>=45,\"3rd in group\",\"Group stage\"),\"1/32 final\"))","v":""}]
[{"$f":"IF(C$3<46,\"\",IF(C$7<46,IF(C$4+C$7>=46,C$7+1,C$7+C$4+1),33))","v":""},null,null,null,{"$f":"IF(C$3<46,\"\",IF(C$7<46,IF(C$4+C$7>=46,\"3rd in group\",\"Group stage\"),\"1/32 final\"))","v":""}]
[{"$f":"IF(C$3<47,\"\",IF(C$7<47,IF(C$4+C$7>=47,C$7+1,C$7+C$4+1),33))","v":""},null,null,null,{"$f":"IF(C$3<47,\"\",IF(C$7<47,IF(C$4+C$7>=47,\"3rd in group\",\"Group stage\"),\"1/32 final\"))","v":""}]
[{"$f":"IF(C$3<48,\"\",IF(C$7<48,IF(C$4+C$7>=48,C$7+1,C$7+C$4+1),33))","v":""},null,null,null,{"$f":"IF(C$3<48,\"\",IF(C$7<48,IF(C$4+C$7>=48,\"3rd in group\",\"Group stage\"),\"1/32 final\"))","v":""}]
[{"$f":"IF(C$3<49,\"\",IF(C$7<49,IF(C$4+C$7>=49,C$7+1,C$7+C$4+1),33))","v":""},null,null,null,{"$f":"IF(C$3<49,\"\",IF(C$7<49,IF(C$4+C$7>=49,\"3rd in group\",\"Group stage\"),\"1/32 final\"))","v":""}]
[{"$f":"IF(C$3<50,\"\",IF(C$7<50,IF(C$4+C$7>=50,C$7+1,C$7+C$4+1),33))","v":""},null,null,null,{"$f":"IF(C$3<50,\"\",IF(C$7<50,IF(C$4+C$7>=50,\"3rd in group\",\"Group stage\"),\"1/32 final\"))","v":""}]
[{"$f":"IF(C$3<51,\"\",IF(C$7<51,IF(C$4+C$7>=51,C$7+1,C$7+C$4+1),33))","v":""},null,null,null,{"$f":"IF(C$3<51,\"\",IF(C$7<51,IF(C$4+C$7>=51,\"3rd in group\",\"Group stage\"),\"1/32 final\"))","v":""}]
[{"$f":"IF(C$3<52,\"\",IF(C$7<52,IF(C$4+C$7>=52,C$7+1,C$7+C$4+1),33))","v":""},null,null,null,{"$f":"IF(C$3<52,\"\",IF(C$7<52,IF(C$4+C$7>=52,\"3rd in group\",\"Group stage\"),\"1/32 final\"))","v":""}]
[{"$f":"IF(C$3<53,\"\",IF(C$7<53,IF(C$4+C$7>=53,C$7+1,C$7+C$4+1),33))","v":""},null,null,null,{"$f":"IF(C$3<53,\"\",IF(C$7<53,IF(C$4+C$7>=53,\"3rd in group\",\"Group stage\"),\"1/32 final\"))","v":""}]
[{"$f":"IF(C$3<54,\"\",IF(C$7<54,IF(C$4+C$7>=54,C$7+1,C$7+C$4+1),33))","v":""},null,null,null,{"$f":"IF(C$3<54,\"\",IF(C$7<54,IF(C$4+C$7>=54,\"3rd in group\",\"Group stage\"),\"1/32 final\"))","v":""}]
[{"$f":"IF(C$3<55,\"\",IF(C$7<55,IF(C$4+C$7>=55,C$7+1,C$7+C$4+1),33))","v":""},null,null,null,{"$f":"IF(C$3<55,\"\",IF(C$7<55,IF(C$4+C$7>=55,\"3rd in group\",\"Group stage\"),\"1/32 final\"))","v":""}]
[{"$f":"IF(C$3<56,\"\",IF(C$7<56,IF(C$4+C$7>=56,C$7+1,C$7+C$4+1),33))","v":""},null,null,null,{"$f":"IF(C$3<56,\"\",IF(C$7<56,IF(C$4+C$7>=56,\"3rd in group\",\"Group stage\"),\"1/32 final\"))","v":""}]
[{"$f":"IF(C$3<57,\"\",IF(C$7<57,IF(C$4+C$7>=57,C$7+1,C$7+C$4+1),33))","v":""},null,null,null,{"$f":"IF(C$3<57,\"\",IF(C$7<57,IF(C$4+C$7>=57,\"3rd in group\",\"Group stage\"),\"1/32 final\"))","v":""}]
[{"$f":"IF(C$3<58,\"\",IF(C$7<58,IF(C$4+C$7>=58,C$7+1,C$7+C$4+1),33))","v":""},null,null,null,{"$f":"IF(C$3<58,\"\",IF(C$7<58,IF(C$4+C$7>=58,\"3rd in group\",\"Group stage\"),\"1/32 final\"))","v":""}]
[{"$f":"IF(C$3<59,\"\",IF(C$7<59,IF(C$4+C$7>=59,C$7+1,C$7+C$4+1),33))","v":""},null,null,null,{"$f":"IF(C$3<59,\"\",IF(C$7<59,IF(C$4+C$7>=59,\"3rd in group\",\"Group stage\"),\"1/32 final\"))","v":""}]
[{"$f":"IF(C$3<60,\"\",IF(C$7<60,IF(C$4+C$7>=60,C$7+1,C$7+C$4+1),33))","v":""},null,null,null,{"$f":"IF(C$3<60,\"\",IF(C$7<60,IF(C$4+C$7>=60,\"3rd in group\",\"Group stage\"),\"1/32 final\"))","v":""}]
[{"$f":"IF(C$3<61,\"\",IF(C$7<61,IF(C$4+C$7>=61,C$7+1,C$7+C$4+1),33))","v":""},null,null,null,{"$f":"IF(C$3<61,\"\",IF(C$7<61,IF(C$4+C$7>=61,\"3rd in group\",\"Group stage\"),\"1/32 final\"))","v":""}]
[{"$f":"IF(C$3<62,\"\",IF(C$7<62,IF(C$4+C$7>=62,C$7+1,C$7+C$4+1),33))","v":""},null,null,null,{"$f":"IF(C$3<62,\"\",IF(C$7<62,IF(C$4+C$7>=62,\"3rd in group\",\"Group stage\"),\"1/32 final\"))","v":""}]
[{"$f":"IF(C$3<63,\"\",IF(C$7<63,IF(C$4+C$7>=63,C$7+1,C$7+C$4+1),33))","v":""},null,null,null,{"$f":"IF(C$3<63,\"\",IF(C$7<63,IF(C$4+C$7>=63,\"3rd in group\",\"Group stage\"),\"1/32 final\"))","v":""}]
[{"$f":"IF(C$3<64,\"\",IF(C$7<64,IF(C$4+C$7>=64,C$7+1,C$7+C$4+1),33))","v":""},null,null,null,{"$f":"IF(C$3<64,\"\",IF(C$7<64,IF(C$4+C$7>=64,\"3rd in group\",\"Group stage\"),\"1/32 final\"))","v":""}]

{"sheet":"Male O40","index":4,"n_rows":73,"n_cols":5,"rows_kept":73,"cut":false,"hidden":false,"merged":[[0,0,0,4]]}
["Male singles: Senior 40+"]
[]
[null,"Number of players:",16]
[null,"Number of groups :",{"$f":"IF(C3<6,1,IF(C3<11,2,IF(C3=11,3,INT(C3/4))))","v":4}]
[null,"Tournament scheme:",{"$f":"CONCATENATE(IF(C3<6,CONCATENATE(\"1*\",C3),\"\"),IF(C3=6,\"2*3\",\"\"),IF(C3=7,\"1*4 + 1*3\",\"\"),IF(C3=11,\"2*4 + 1*3\",\"\"),IF(OR(C3=15,C3=10),CONCATENATE(C3/5,\"*5\"),\"\"),IF(OR(C3<=7,C3=10,C3=11,C3=15),\"\",CONCATENATE(INT(C3/4)-MOD(C3,4),\"*4\",IF(MOD(C3,4)=0,\"\",CONCATENATE(\" + \",MOD(C3,4),\"*5\")))))","v":"4*4"}]
[null,"Qualification:",{"$f":"IF(C3>=6,\"2 players per group\",\"NA\")","v":"2 players per group"}]
[null,"Nb of qualified players :",{"$f":"IF(C3<6,\"NA\",IF(C3<11,4,IF(C3=11,6,INT(C3/4)*2)))","v":8}]
[]
["Rank","Family name","First-name","Country","Reached stage"]
[1,null,null,null,{"$f":"IF(C$3<6,\"Group stage\",\"Final\")","v":"Final"}]
[2,null,null,null,"Final"]
[3,null,null,null,{"$f":"IF(C$3<6,\"Group stage\",\"1/2 final\")","v":"1/2 final"}]
[{"$f":"IF(C$3<6,4,3)","v":3},null,null,null,"1/2 final"]
[{"$f":"IF(C$3<5,\"\",5)","v":5},null,null,null,{"$f":"IF(C$3<5,\"\",IF(C$3=5,\"Group stage\",IF(C$7<5,\"3rd in group\",\"1/4 final\")))","v":"1/4 final"}]
[{"$f":"IF(C$3<6,\"\",5)","v":5},null,null,null,{"$f":"IF(C$3<6,\"\",IF(C$7<6,\"3rd in group\",\"1/4 final\"))","v":"1/4 final"}]
[{"$f":"IF(C$3<7,\"\",IF(C$7<7,IF(C$4+C$7>=7,C$7+1,C$7+C$4+1),5))","v":5},null,null,null,{"$f":"IF(C$3<7,\"\",IF(C$7<7,IF(C$4+C$7>=7,\"3rd in group\",\"Group stage\"),\"1/4 final\"))","v":"1/4 final"}]
[{"$f":"IF(C$3<8,\"\",IF(C$7<8,IF(C$4+C$7>=8,C$7+1,C$7+C$4+1),5))","v":5},null,null,null,{"$f":"IF(C$3<8,\"\",IF(C$7<8,IF(C$4+C$7>=8,\"3rd in group\",\"Group stage\"),\"1/4 final\"))","v":"1/4 final"}]
[{"$f":"IF(C$3<9,\"\",IF(C$7<9,IF(C$4+C$7>=9,C$7+1,C$7+C$4+1),9))","v":9},null,null,null,{"$f":"IF(C$3<9,\"\",IF(C$7<9,IF(C$4+C$7>=9,\"3rd in group\",\"Group stage\"),\"1/8 final\"))","v":"3rd in group"}]
[{"$f":"IF(C$3<10,\"\",IF(C$7<10,IF(C$4+C$7>=10,C$7+1,C$7+C$4+1),9))","v":9},null,null,null,{"$f":"IF(C$3<10,\"\",IF(C$7<10,IF(C$4+C$7>=10,\"3rd in group\",\"Group stage\"),\"1/8 final\"))","v":"3rd in group"}]
[{"$f":"IF(C$3<11,\"\",IF(C$7<11,IF(C$4+C$7>=11,C$7+1,C$7+C$4+1),9))","v":9},null,null,null,{"$f":"IF(C$3<11,\"\",IF(C$7<11,IF(C$4+C$7>=11,\"3rd in group\",\"Group stage\"),\"1/8 final\"))","v":"3rd in group"}]
[{"$f":"IF(C$3<12,\"\",IF(C$7<12,IF(C$4+C$7>=12,C$7+1,C$7+C$4+1),9))","v":9},null,null,null,{"$f":"IF(C$3<12,\"\",IF(C$7<12,IF(C$4+C$7>=12,\"3rd in group\",\"Group stage\"),\"1/8 final\"))","v":"3rd in group"}]
[{"$f":"IF(C$3<13,\"\",IF(C$7<13,IF(C$4+C$7>=13,C$7+1,C$7+C$4+1),9))","v":13},null,null,null,{"$f":"IF(C$3<13,\"\",IF(C$7<13,IF(C$4+C$7>=13,\"3rd in group\",\"Group stage\"),\"1/8 final\"))","v":"Group stage"}]
[{"$f":"IF(C$3<14,\"\",IF(C$7<14,IF(C$4+C$7>=14,C$7+1,C$7+C$4+1),9))","v":13},null,null,null,{"$f":"IF(C$3<14,\"\",IF(C$7<14,IF(C$4+C$7>=14,\"3rd in group\",\"Group stage\"),\"1/8 final\"))","v":"Group stage"}]
[{"$f":"IF(C$3<15,\"\",IF(C$7<15,IF(C$4+C$7>=15,C$7+1,C$7+C$4+1),9))","v":13},null,null,null,{"$f":"IF(C$3<15,\"\",IF(C$7<15,IF(C$4+C$7>=15,\"3rd in group\",\"Group stage\"),\"1/8 final\"))","v":"Group stage"}]
[{"$f":"IF(C$3<16,\"\",IF(C$7<16,IF(C$4+C$7>=16,C$7+1,C$7+C$4+1),9))","v":13},null,null,null,{"$f":"IF(C$3<16,\"\",IF(C$7<16,IF(C$4+C$7>=16,\"3rd in group\",\"Group stage\"),\"1/8 final\"))","v":"Group stage"}]
[{"$f":"IF(C$3<17,\"\",IF(C$7<17,IF(C$4+C$7>=17,C$7+1,C$7+C$4+1),17))","v":""},null,null,null,{"$f":"IF(C$3<17,\"\",IF(C$7<17,IF(C$4+C$7>=17,\"3rd in group\",\"Group stage\"),\"1/16 final\"))","v":""}]
[{"$f":"IF(C$3<18,\"\",IF(C$7<18,IF(C$4+C$7>=18,C$7+1,C$7+C$4+1),17))","v":""},null,null,null,{"$f":"IF(C$3<18,\"\",IF(C$7<18,IF(C$4+C$7>=18,\"3rd in group\",\"Group stage\"),\"1/16 final\"))","v":""}]
[{"$f":"IF(C$3<19,\"\",IF(C$7<19,IF(C$4+C$7>=19,C$7+1,C$7+C$4+1),17))","v":""},null,null,null,{"$f":"IF(C$3<19,\"\",IF(C$7<19,IF(C$4+C$7>=19,\"3rd in group\",\"Group stage\"),\"1/16 final\"))","v":""}]
[{"$f":"IF(C$3<20,\"\",IF(C$7<20,IF(C$4+C$7>=20,C$7+1,C$7+C$4+1),17))","v":""},null,null,null,{"$f":"IF(C$3<20,\"\",IF(C$7<20,IF(C$4+C$7>=20,\"3rd in group\",\"Group stage\"),\"1/16 final\"))","v":""}]
[{"$f":"IF(C$3<21,\"\",IF(C$7<21,IF(C$4+C$7>=21,C$7+1,C$7+C$4+1),17))","v":""},null,null,null,{"$f":"IF(C$3<21,\"\",IF(C$7<21,IF(C$4+C$7>=21,\"3rd in group\",\"Group stage\"),\"1/16 final\"))","v":""}]
[{"$f":"IF(C$3<22,\"\",IF(C$7<22,IF(C$4+C$7>=22,C$7+1,C$7+C$4+1),17))","v":""},null,null,null,{"$f":"IF(C$3<22,\"\",IF(C$7<22,IF(C$4+C$7>=22,\"3rd in group\",\"Group stage\"),\"1/16 final\"))","v":""}]
[{"$f":"IF(C$3<23,\"\",IF(C$7<23,IF(C$4+C$7>=23,C$7+1,C$7+C$4+1),17))","v":""},null,null,null,{"$f":"IF(C$3<23,\"\",IF(C$7<23,IF(C$4+C$7>=23,\"3rd in group\",\"Group stage\"),\"1/16 final\"))","v":""}]
[{"$f":"IF(C$3<24,\"\",IF(C$7<24,IF(C$4+C$7>=24,C$7+1,C$7+C$4+1),17))","v":""},null,null,null,{"$f":"IF(C$3<24,\"\",IF(C$7<24,IF(C$4+C$7>=24,\"3rd in group\",\"Group stage\"),\"1/16 final\"))","v":""}]
[{"$f":"IF(C$3<25,\"\",IF(C$7<25,IF(C$4+C$7>=25,C$7+1,C$7+C$4+1),17))","v":""},null,null,null,{"$f":"IF(C$3<25,\"\",IF(C$7<25,IF(C$4+C$7>=25,\"3rd in group\",\"Group stage\"),\"1/16 final\"))","v":""}]
[{"$f":"IF(C$3<26,\"\",IF(C$7<26,IF(C$4+C$7>=26,C$7+1,C$7+C$4+1),17))","v":""},null,null,null,{"$f":"IF(C$3<26,\"\",IF(C$7<26,IF(C$4+C$7>=26,\"3rd in group\",\"Group stage\"),\"1/16 final\"))","v":""}]
[{"$f":"IF(C$3<27,\"\",IF(C$7<27,IF(C$4+C$7>=27,C$7+1,C$7+C$4+1),17))","v":""},null,null,null,{"$f":"IF(C$3<27,\"\",IF(C$7<27,IF(C$4+C$7>=27,\"3rd in group\",\"Group stage\"),\"1/16 final\"))","v":""}]
[{"$f":"IF(C$3<28,\"\",IF(C$7<28,IF(C$4+C$7>=28,C$7+1,C$7+C$4+1),17))","v":""},null,null,null,{"$f":"IF(C$3<28,\"\",IF(C$7<28,IF(C$4+C$7>=28,\"3rd in group\",\"Group stage\"),\"1/16 final\"))","v":""}]
[{"$f":"IF(C$3<29,\"\",IF(C$7<29,IF(C$4+C$7>=29,C$7+1,C$7+C$4+1),17))","v":""},null,null,null,{"$f":"IF(C$3<29,\"\",IF(C$7<29,IF(C$4+C$7>=29,\"3rd in group\",\"Group stage\"),\"1/16 final\"))","v":""}]
[{"$f":"IF(C$3<30,\"\",IF(C$7<30,IF(C$4+C$7>=30,C$7+1,C$7+C$4+1),17))","v":""},null,null,null,{"$f":"IF(C$3<30,\"\",IF(C$7<30,IF(C$4+C$7>=30,\"3rd in group\",\"Group stage\"),\"1/16 final\"))","v":""}]
[{"$f":"IF(C$3<31,\"\",IF(C$7<31,IF(C$4+C$7>=31,C$7+1,C$7+C$4+1),17))","v":""},null,null,null,{"$f":"IF(C$3<31,\"\",IF(C$7<31,IF(C$4+C$7>=31,\"3rd in group\",\"Group stage\"),\"1/16 final\"))","v":""}]
[{"$f":"IF(C$3<32,\"\",IF(C$7<32,IF(C$4+C$7>=32,C$7+1,C$7+C$4+1),17))","v":""},null,null,null,{"$f":"IF(C$3<32,\"\",IF(C$7<32,IF(C$4+C$7>=32,\"3rd in group\",\"Group stage\"),\"1/16 final\"))","v":""}]
[{"$f":"IF(C$3<33,\"\",IF(C$7<33,IF(C$4+C$7>=33,C$7+1,C$7+C$4+1),33))","v":""},null,null,null,{"$f":"IF(C$3<33,\"\",IF(C$7<33,IF(C$4+C$7>=33,\"3rd in group\",\"Group stage\"),\"1/32 final\"))","v":""}]
[{"$f":"IF(C$3<34,\"\",IF(C$7<34,IF(C$4+C$7>=34,C$7+1,C$7+C$4+1),33))","v":""},null,null,null,{"$f":"IF(C$3<34,\"\",IF(C$7<34,IF(C$4+C$7>=34,\"3rd in group\",\"Group stage\"),\"1/32 final\"))","v":""}]
[{"$f":"IF(C$3<35,\"\",IF(C$7<35,IF(C$4+C$7>=35,C$7+1,C$7+C$4+1),33))","v":""},null,null,null,{"$f":"IF(C$3<35,\"\",IF(C$7<35,IF(C$4+C$7>=35,\"3rd in group\",\"Group stage\"),\"1/32 final\"))","v":""}]
[{"$f":"IF(C$3<36,\"\",IF(C$7<36,IF(C$4+C$7>=36,C$7+1,C$7+C$4+1),33))","v":""},null,null,null,{"$f":"IF(C$3<36,\"\",IF(C$7<36,IF(C$4+C$7>=36,\"3rd in group\",\"Group stage\"),\"1/32 final\"))","v":""}]
[{"$f":"IF(C$3<37,\"\",IF(C$7<37,IF(C$4+C$7>=37,C$7+1,C$7+C$4+1),33))","v":""},null,null,null,{"$f":"IF(C$3<37,\"\",IF(C$7<37,IF(C$4+C$7>=37,\"3rd in group\",\"Group stage\"),\"1/32 final\"))","v":""}]
[{"$f":"IF(C$3<38,\"\",IF(C$7<38,IF(C$4+C$7>=38,C$7+1,C$7+C$4+1),33))","v":""},null,null,null,{"$f":"IF(C$3<38,\"\",IF(C$7<38,IF(C$4+C$7>=38,\"3rd in group\",\"Group stage\"),\"1/32 final\"))","v":""}]
[{"$f":"IF(C$3<39,\"\",IF(C$7<39,IF(C$4+C$7>=39,C$7+1,C$7+C$4+1),33))","v":""},null,null,null,{"$f":"IF(C$3<39,\"\",IF(C$7<39,IF(C$4+C$7>=39,\"3rd in group\",\"Group stage\"),\"1/32 final\"))","v":""}]
[{"$f":"IF(C$3<40,\"\",IF(C$7<40,IF(C$4+C$7>=40,C$7+1,C$7+C$4+1),33))","v":""},null,null,null,{"$f":"IF(C$3<40,\"\",IF(C$7<40,IF(C$4+C$7>=40,\"3rd in group\",\"Group stage\"),\"1/32 final\"))","v":""}]
[{"$f":"IF(C$3<41,\"\",IF(C$7<41,IF(C$4+C$7>=41,C$7+1,C$7+C$4+1),33))","v":""},null,null,null,{"$f":"IF(C$3<41,\"\",IF(C$7<41,IF(C$4+C$7>=41,\"3rd in group\",\"Group stage\"),\"1/32 final\"))","v":""}]
[{"$f":"IF(C$3<42,\"\",IF(C$7<42,IF(C$4+C$7>=42,C$7+1,C$7+C$4+1),33))","v":""},null,null,null,{"$f":"IF(C$3<42,\"\",IF(C$7<42,IF(C$4+C$7>=42,\"3rd in group\",\"Group stage\"),\"1/32 final\"))","v":""}]
[{"$f":"IF(C$3<43,\"\",IF(C$7<43,IF(C$4+C$7>=43,C$7+1,C$7+C$4+1),33))","v":""},null,null,null,{"$f":"IF(C$3<43,\"\",IF(C$7<43,IF(C$4+C$7>=43,\"3rd in group\",\"Group stage\"),\"1/32 final\"))","v":""}]
[{"$f":"IF(C$3<44,\"\",IF(C$7<44,IF(C$4+C$7>=44,C$7+1,C$7+C$4+1),33))","v":""},null,null,null,{"$f":"IF(C$3<44,\"\",IF(C$7<44,IF(C$4+C$7>=44,\"3rd in group\",\"Group stage\"),\"1/32 final\"))","v":""}]
[{"$f":"IF(C$3<45,\"\",IF(C$7<45,IF(C$4+C$7>=45,C$7+1,C$7+C$4+1),33))","v":""},null,null,null,{"$f":"IF(C$3<45,\"\",IF(C$7<45,IF(C$4+C$7>=45,\"3rd in group\",\"Group stage\"),\"1/32 final\"))","v":""}]
[{"$f":"IF(C$3<46,\"\",IF(C$7<46,IF(C$4+C$7>=46,C$7+1,C$7+C$4+1),33))","v":""},null,null,null,{"$f":"IF(C$3<46,\"\",IF(C$7<46,IF(C$4+C$7>=46,\"3rd in group\",\"Group stage\"),\"1/32 final\"))","v":""}]
[{"$f":"IF(C$3<47,\"\",IF(C$7<47,IF(C$4+C$7>=47,C$7+1,C$7+C$4+1),33))","v":""},null,null,null,{"$f":"IF(C$3<47,\"\",IF(C$7<47,IF(C$4+C$7>=47,\"3rd in group\",\"Group stage\"),\"1/32 final\"))","v":""}]
[{"$f":"IF(C$3<48,\"\",IF(C$7<48,IF(C$4+C$7>=48,C$7+1,C$7+C$4+1),33))","v":""},null,null,null,{"$f":"IF(C$3<48,\"\",IF(C$7<48,IF(C$4+C$7>=48,\"3rd in group\",\"Group stage\"),\"1/32 final\"))","v":""}]
[{"$f":"IF(C$3<49,\"\",IF(C$7<49,IF(C$4+C$7>=49,C$7+1,C$7+C$4+1),33))","v":""},null,null,null,{"$f":"IF(C$3<49,\"\",IF(C$7<49,IF(C$4+C$7>=49,\"3rd in group\",\"Group stage\"),\"1/32 final\"))","v":""}]
[{"$f":"IF(C$3<50,\"\",IF(C$7<50,IF(C$4+C$7>=50,C$7+1,C$7+C$4+1),33))","v":""},null,null,null,{"$f":"IF(C$3<50,\"\",IF(C$7<50,IF(C$4+C$7>=50,\"3rd in group\",\"Group stage\"),\"1/32 final\"))","v":""}]
[{"$f":"IF(C$3<51,\"\",IF(C$7<51,IF(C$4+C$7>=51,C$7+1,C$7+C$4+1),33))","v":""},null,null,null,{"$f":"IF(C$3<51,\"\",IF(C$7<51,IF(C$4+C$7>=51,\"3rd in group\",\"Group stage\"),\"1/32 final\"))","v":""}]
[{"$f":"IF(C$3<52,\"\",IF(C$7<52,IF(C$4+C$7>=52,C$7+1,C$7+C$4+1),33))","v":""},null,null,null,{"$f":"IF(C$3<52,\"\",IF(C$7<52,IF(C$4+C$7>=52,\"3rd in group\",\"Group stage\"),\"1/32 final\"))","v":""}]
[{"$f":"IF(C$3<53,\"\",IF(C$7<53,IF(C$4+C$7>=53,C$7+1,C$7+C$4+1),33))","v":""},null,null,null,{"$f":"IF(C$3<53,\"\",IF(C$7<53,IF(C$4+C$7>=53,\"3rd in group\",\"Group stage\"),\"1/32 final\"))","v":""}]
[{"$f":"IF(C$3<54,\"\",IF(C$7<54,IF(C$4+C$7>=54,C$7+1,C$7+C$4+1),33))","v":""},null,null,null,{"$f":"IF(C$3<54,\"\",IF(C$7<54,IF(C$4+C$7>=54,\"3rd in group\",\"Group stage\"),\"1/32 final\"))","v":""}]
[{"$f":"IF(C$3<55,\"\",IF(C$7<55,IF(C$4+C$7>=55,C$7+1,C$7+C$4+1),33))","v":""},null,null,null,{"$f":"IF(C$3<55,\"\",IF(C$7<55,IF(C$4+C$7>=55,\"3rd in group\",\"Group stage\"),\"1/32 final\"))","v":""}]
[{"$f":"IF(C$3<56,\"\",IF(C$7<56,IF(C$4+C$7>=56,C$7+1,C$7+C$4+1),33))","v":""},null,null,null,{"$f":"IF(C$3<56,\"\",IF(C$7<56,IF(C$4+C$7>=56,\"3rd in group\",\"Group stage\"),\"1/32 final\"))","v":""}]
[{"$f":"IF(C$3<57,\"\",IF(C$7<57,IF(C$4+C$7>=57,C$7+1,C$7+C$4+1),33))","v":""},null,null,null,{"$f":"IF(C$3<57,\"\",IF(C$7<57,IF(C$4+C$7>=57,\"3rd in group\",\"Group stage\"),\"1/32 final\"))","v":""}]
[{"$f":"IF(C$3<58,\"\",IF(C$7<58,IF(C$4+C$7>=58,C$7+1,C$7+C$4+1),33))","v":""},null,null,null,{"$f":"IF(C$3<58,\"\",IF(C$7<58,IF(C$4+C$7>=58,\"3rd in group\",\"Group stage\"),\"1/32 final\"))","v":""}]
[{"$f":"IF(C$3<59,\"\",IF(C$7<59,IF(C$4+C$7>=59,C$7+1,C$7+C$4+1),33))","v":""},null,null,null,{"$f":"IF(C$3<59,\"\",IF(C$7<59,IF(C$4+C$7>=59,\"3rd in group\",\"Group stage\"),\"1/32 final\"))","v":""}]
[{"$f":"IF(C$3<60,\"\",IF(C$7<60,IF(C$4+C$7>=60,C$7+1,C$7+C$4+1),33))","v":""},null,null,null,{"$f":"IF(C$3<60,\"\",IF(C$7<60,IF(C$4+C$7>=60,\"3rd in group\",\"Group stage\"),\"1/32 final\"))","v":""}]
[{"$f":"IF(C$3<61,\"\",IF(C$7<61,IF(C$4+C$7>=61,C$7+1,C$7+C$4+1),33))","v":""},null,null,null,{"$f":"IF(C$3<61,\"\",IF(C$7<61,IF(C$4+C$7>=61,\"3rd in group\",\"Group stage\"),\"1/32 final\"))","v":""}]
[{"$f":"IF(C$3<62,\"\",IF(C$7<62,IF(C$4+C$7>=62,C$7+1,C$7+C$4+1),33))","v":""},null,null,null,{"$f":"IF(C$3<62,\"\",IF(C$7<62,IF(C$4+C$7>=62,\"3rd in group\",\"Group stage\"),\"1/32 final\"))","v":""}]
[{"$f":"IF(C$3<63,\"\",IF(C$7<63,IF(C$4+C$7>=63,C$7+1,C$7+C$4+1),33))","v":""},null,null,null,{"$f":"IF(C$3<63,\"\",IF(C$7<63,IF(C$4+C$7>=63,\"3rd in group\",\"Group stage\"),\"1/32 final\"))","v":""}]
[{"$f":"IF(C$3<64,\"\",IF(C$7<64,IF(C$4+C$7>=64,C$7+1,C$7+C$4+1),33))","v":""},null,null,null,{"$f":"IF(C$3<64,\"\",IF(C$7<64,IF(C$4+C$7>=64,\"3rd in group\",\"Group stage\"),\"1/32 final\"))","v":""}]

{"sheet":"Male O50","index":5,"n_rows":73,"n_cols":5,"rows_kept":73,"cut":false,"hidden":false,"merged":[[0,0,0,4]]}
["Male singles: Senior 50+"]
[]
[null,"Number of players:",16]
[null,"Number of groups :",{"$f":"IF(C3<6,1,IF(C3<11,2,IF(C3=11,3,INT(C3/4))))","v":4}]
[null,"Tournament scheme:",{"$f":"CONCATENATE(IF(C3<6,CONCATENATE(\"1*\",C3),\"\"),IF(C3=6,\"2*3\",\"\"),IF(C3=7,\"1*4 + 1*3\",\"\"),IF(C3=11,\"2*4 + 1*3\",\"\"),IF(OR(C3=15,C3=10),CONCATENATE(C3/5,\"*5\"),\"\"),IF(OR(C3<=7,C3=10,C3=11,C3=15),\"\",CONCATENATE(INT(C3/4)-MOD(C3,4),\"*4\",IF(MOD(C3,4)=0,\"\",CONCATENATE(\" + \",MOD(C3,4),\"*5\")))))","v":"4*4"}]
[null,"Qualification:",{"$f":"IF(C3>=6,\"2 players per group\",\"NA\")","v":"2 players per group"}]
[null,"Nb of qualified players :",{"$f":"IF(C3<6,\"NA\",IF(C3<11,4,IF(C3=11,6,INT(C3/4)*2)))","v":8}]
[]
["Rank","Family name","First-name","Country","Reached stage"]
[1,null,null,null,{"$f":"IF(C$3<6,\"Group stage\",\"Final\")","v":"Final"}]
[2,null,null,null,"Final"]
[3,null,null,null,{"$f":"IF(C$3<6,\"Group stage\",\"1/2 final\")","v":"1/2 final"}]
[{"$f":"IF(C$3<6,4,3)","v":3},null,null,null,"1/2 final"]
[{"$f":"IF(C$3<5,\"\",5)","v":5},null,null,null,{"$f":"IF(C$3<5,\"\",IF(C$3=5,\"Group stage\",IF(C$7<5,\"3rd in group\",\"1/4 final\")))","v":"1/4 final"}]
[{"$f":"IF(C$3<6,\"\",5)","v":5},null,null,null,{"$f":"IF(C$3<6,\"\",IF(C$7<6,\"3rd in group\",\"1/4 final\"))","v":"1/4 final"}]
[{"$f":"IF(C$3<7,\"\",IF(C$7<7,IF(C$4+C$7>=7,C$7+1,C$7+C$4+1),5))","v":5},null,null,null,{"$f":"IF(C$3<7,\"\",IF(C$7<7,IF(C$4+C$7>=7,\"3rd in group\",\"Group stage\"),\"1/4 final\"))","v":"1/4 final"}]
[{"$f":"IF(C$3<8,\"\",IF(C$7<8,IF(C$4+C$7>=8,C$7+1,C$7+C$4+1),5))","v":5},null,null,null,{"$f":"IF(C$3<8,\"\",IF(C$7<8,IF(C$4+C$7>=8,\"3rd in group\",\"Group stage\"),\"1/4 final\"))","v":"1/4 final"}]
[{"$f":"IF(C$3<9,\"\",IF(C$7<9,IF(C$4+C$7>=9,C$7+1,C$7+C$4+1),9))","v":9},null,null,null,{"$f":"IF(C$3<9,\"\",IF(C$7<9,IF(C$4+C$7>=9,\"3rd in group\",\"Group stage\"),\"1/8 final\"))","v":"3rd in group"}]
[{"$f":"IF(C$3<10,\"\",IF(C$7<10,IF(C$4+C$7>=10,C$7+1,C$7+C$4+1),9))","v":9},null,null,null,{"$f":"IF(C$3<10,\"\",IF(C$7<10,IF(C$4+C$7>=10,\"3rd in group\",\"Group stage\"),\"1/8 final\"))","v":"3rd in group"}]
[{"$f":"IF(C$3<11,\"\",IF(C$7<11,IF(C$4+C$7>=11,C$7+1,C$7+C$4+1),9))","v":9},null,null,null,{"$f":"IF(C$3<11,\"\",IF(C$7<11,IF(C$4+C$7>=11,\"3rd in group\",\"Group stage\"),\"1/8 final\"))","v":"3rd in group"}]
[{"$f":"IF(C$3<12,\"\",IF(C$7<12,IF(C$4+C$7>=12,C$7+1,C$7+C$4+1),9))","v":9},null,null,null,{"$f":"IF(C$3<12,\"\",IF(C$7<12,IF(C$4+C$7>=12,\"3rd in group\",\"Group stage\"),\"1/8 final\"))","v":"3rd in group"}]
[{"$f":"IF(C$3<13,\"\",IF(C$7<13,IF(C$4+C$7>=13,C$7+1,C$7+C$4+1),9))","v":13},null,null,null,{"$f":"IF(C$3<13,\"\",IF(C$7<13,IF(C$4+C$7>=13,\"3rd in group\",\"Group stage\"),\"1/8 final\"))","v":"Group stage"}]
[{"$f":"IF(C$3<14,\"\",IF(C$7<14,IF(C$4+C$7>=14,C$7+1,C$7+C$4+1),9))","v":13},null,null,null,{"$f":"IF(C$3<14,\"\",IF(C$7<14,IF(C$4+C$7>=14,\"3rd in group\",\"Group stage\"),\"1/8 final\"))","v":"Group stage"}]
[{"$f":"IF(C$3<15,\"\",IF(C$7<15,IF(C$4+C$7>=15,C$7+1,C$7+C$4+1),9))","v":13},null,null,null,{"$f":"IF(C$3<15,\"\",IF(C$7<15,IF(C$4+C$7>=15,\"3rd in group\",\"Group stage\"),\"1/8 final\"))","v":"Group stage"}]
[{"$f":"IF(C$3<16,\"\",IF(C$7<16,IF(C$4+C$7>=16,C$7+1,C$7+C$4+1),9))","v":13},null,null,null,{"$f":"IF(C$3<16,\"\",IF(C$7<16,IF(C$4+C$7>=16,\"3rd in group\",\"Group stage\"),\"1/8 final\"))","v":"Group stage"}]
[{"$f":"IF(C$3<17,\"\",IF(C$7<17,IF(C$4+C$7>=17,C$7+1,C$7+C$4+1),17))","v":""},null,null,null,{"$f":"IF(C$3<17,\"\",IF(C$7<17,IF(C$4+C$7>=17,\"3rd in group\",\"Group stage\"),\"1/16 final\"))","v":""}]
[{"$f":"IF(C$3<18,\"\",IF(C$7<18,IF(C$4+C$7>=18,C$7+1,C$7+C$4+1),17))","v":""},null,null,null,{"$f":"IF(C$3<18,\"\",IF(C$7<18,IF(C$4+C$7>=18,\"3rd in group\",\"Group stage\"),\"1/16 final\"))","v":""}]
[{"$f":"IF(C$3<19,\"\",IF(C$7<19,IF(C$4+C$7>=19,C$7+1,C$7+C$4+1),17))","v":""},null,null,null,{"$f":"IF(C$3<19,\"\",IF(C$7<19,IF(C$4+C$7>=19,\"3rd in group\",\"Group stage\"),\"1/16 final\"))","v":""}]
[{"$f":"IF(C$3<20,\"\",IF(C$7<20,IF(C$4+C$7>=20,C$7+1,C$7+C$4+1),17))","v":""},null,null,null,{"$f":"IF(C$3<20,\"\",IF(C$7<20,IF(C$4+C$7>=20,\"3rd in group\",\"Group stage\"),\"1/16 final\"))","v":""}]
[{"$f":"IF(C$3<21,\"\",IF(C$7<21,IF(C$4+C$7>=21,C$7+1,C$7+C$4+1),17))","v":""},null,null,null,{"$f":"IF(C$3<21,\"\",IF(C$7<21,IF(C$4+C$7>=21,\"3rd in group\",\"Group stage\"),\"1/16 final\"))","v":""}]
[{"$f":"IF(C$3<22,\"\",IF(C$7<22,IF(C$4+C$7>=22,C$7+1,C$7+C$4+1),17))","v":""},null,null,null,{"$f":"IF(C$3<22,\"\",IF(C$7<22,IF(C$4+C$7>=22,\"3rd in group\",\"Group stage\"),\"1/16 final\"))","v":""}]
[{"$f":"IF(C$3<23,\"\",IF(C$7<23,IF(C$4+C$7>=23,C$7+1,C$7+C$4+1),17))","v":""},null,null,null,{"$f":"IF(C$3<23,\"\",IF(C$7<23,IF(C$4+C$7>=23,\"3rd in group\",\"Group stage\"),\"1/16 final\"))","v":""}]
[{"$f":"IF(C$3<24,\"\",IF(C$7<24,IF(C$4+C$7>=24,C$7+1,C$7+C$4+1),17))","v":""},null,null,null,{"$f":"IF(C$3<24,\"\",IF(C$7<24,IF(C$4+C$7>=24,\"3rd in group\",\"Group stage\"),\"1/16 final\"))","v":""}]
[{"$f":"IF(C$3<25,\"\",IF(C$7<25,IF(C$4+C$7>=25,C$7+1,C$7+C$4+1),17))","v":""},null,null,null,{"$f":"IF(C$3<25,\"\",IF(C$7<25,IF(C$4+C$7>=25,\"3rd in group\",\"Group stage\"),\"1/16 final\"))","v":""}]
[{"$f":"IF(C$3<26,\"\",IF(C$7<26,IF(C$4+C$7>=26,C$7+1,C$7+C$4+1),17))","v":""},null,null,null,{"$f":"IF(C$3<26,\"\",IF(C$7<26,IF(C$4+C$7>=26,\"3rd in group\",\"Group stage\"),\"1/16 final\"))","v":""}]
[{"$f":"IF(C$3<27,\"\",IF(C$7<27,IF(C$4+C$7>=27,C$7+1,C$7+C$4+1),17))","v":""},null,null,null,{"$f":"IF(C$3<27,\"\",IF(C$7<27,IF(C$4+C$7>=27,\"3rd in group\",\"Group stage\"),\"1/16 final\"))","v":""}]
[{"$f":"IF(C$3<28,\"\",IF(C$7<28,IF(C$4+C$7>=28,C$7+1,C$7+C$4+1),17))","v":""},null,null,null,{"$f":"IF(C$3<28,\"\",IF(C$7<28,IF(C$4+C$7>=28,\"3rd in group\",\"Group stage\"),\"1/16 final\"))","v":""}]
[{"$f":"IF(C$3<29,\"\",IF(C$7<29,IF(C$4+C$7>=29,C$7+1,C$7+C$4+1),17))","v":""},null,null,null,{"$f":"IF(C$3<29,\"\",IF(C$7<29,IF(C$4+C$7>=29,\"3rd in group\",\"Group stage\"),\"1/16 final\"))","v":""}]
[{"$f":"IF(C$3<30,\"\",IF(C$7<30,IF(C$4+C$7>=30,C$7+1,C$7+C$4+1),17))","v":""},null,null,null,{"$f":"IF(C$3<30,\"\",IF(C$7<30,IF(C$4+C$7>=30,\"3rd in group\",\"Group stage\"),\"1/16 final\"))","v":""}]
[{"$f":"IF(C$3<31,\"\",IF(C$7<31,IF(C$4+C$7>=31,C$7+1,C$7+C$4+1),17))","v":""},null,null,null,{"$f":"IF(C$3<31,\"\",IF(C$7<31,IF(C$4+C$7>=31,\"3rd in group\",\"Group stage\"),\"1/16 final\"))","v":""}]
[{"$f":"IF(C$3<32,\"\",IF(C$7<32,IF(C$4+C$7>=32,C$7+1,C$7+C$4+1),17))","v":""},null,null,null,{"$f":"IF(C$3<32,\"\",IF(C$7<32,IF(C$4+C$7>=32,\"3rd in group\",\"Group stage\"),\"1/16 final\"))","v":""}]
[{"$f":"IF(C$3<33,\"\",IF(C$7<33,IF(C$4+C$7>=33,C$7+1,C$7+C$4+1),33))","v":""},null,null,null,{"$f":"IF(C$3<33,\"\",IF(C$7<33,IF(C$4+C$7>=33,\"3rd in group\",\"Group stage\"),\"1/32 final\"))","v":""}]
[{"$f":"IF(C$3<34,\"\",IF(C$7<34,IF(C$4+C$7>=34,C$7+1,C$7+C$4+1),33))","v":""},null,null,null,{"$f":"IF(C$3<34,\"\",IF(C$7<34,IF(C$4+C$7>=34,\"3rd in group\",\"Group stage\"),\"1/32 final\"))","v":""}]
[{"$f":"IF(C$3<35,\"\",IF(C$7<35,IF(C$4+C$7>=35,C$7+1,C$7+C$4+1),33))","v":""},null,null,null,{"$f":"IF(C$3<35,\"\",IF(C$7<35,IF(C$4+C$7>=35,\"3rd in group\",\"Group stage\"),\"1/32 final\"))","v":""}]
[{"$f":"IF(C$3<36,\"\",IF(C$7<36,IF(C$4+C$7>=36,C$7+1,C$7+C$4+1),33))","v":""},null,null,null,{"$f":"IF(C$3<36,\"\",IF(C$7<36,IF(C$4+C$7>=36,\"3rd in group\",\"Group stage\"),\"1/32 final\"))","v":""}]
[{"$f":"IF(C$3<37,\"\",IF(C$7<37,IF(C$4+C$7>=37,C$7+1,C$7+C$4+1),33))","v":""},null,null,null,{"$f":"IF(C$3<37,\"\",IF(C$7<37,IF(C$4+C$7>=37,\"3rd in group\",\"Group stage\"),\"1/32 final\"))","v":""}]
[{"$f":"IF(C$3<38,\"\",IF(C$7<38,IF(C$4+C$7>=38,C$7+1,C$7+C$4+1),33))","v":""},null,null,null,{"$f":"IF(C$3<38,\"\",IF(C$7<38,IF(C$4+C$7>=38,\"3rd in group\",\"Group stage\"),\"1/32 final\"))","v":""}]
[{"$f":"IF(C$3<39,\"\",IF(C$7<39,IF(C$4+C$7>=39,C$7+1,C$7+C$4+1),33))","v":""},null,null,null,{"$f":"IF(C$3<39,\"\",IF(C$7<39,IF(C$4+C$7>=39,\"3rd in group\",\"Group stage\"),\"1/32 final\"))","v":""}]
[{"$f":"IF(C$3<40,\"\",IF(C$7<40,IF(C$4+C$7>=40,C$7+1,C$7+C$4+1),33))","v":""},null,null,null,{"$f":"IF(C$3<40,\"\",IF(C$7<40,IF(C$4+C$7>=40,\"3rd in group\",\"Group stage\"),\"1/32 final\"))","v":""}]
[{"$f":"IF(C$3<41,\"\",IF(C$7<41,IF(C$4+C$7>=41,C$7+1,C$7+C$4+1),33))","v":""},null,null,null,{"$f":"IF(C$3<41,\"\",IF(C$7<41,IF(C$4+C$7>=41,\"3rd in group\",\"Group stage\"),\"1/32 final\"))","v":""}]
[{"$f":"IF(C$3<42,\"\",IF(C$7<42,IF(C$4+C$7>=42,C$7+1,C$7+C$4+1),33))","v":""},null,null,null,{"$f":"IF(C$3<42,\"\",IF(C$7<42,IF(C$4+C$7>=42,\"3rd in group\",\"Group stage\"),\"1/32 final\"))","v":""}]
[{"$f":"IF(C$3<43,\"\",IF(C$7<43,IF(C$4+C$7>=43,C$7+1,C$7+C$4+1),33))","v":""},null,null,null,{"$f":"IF(C$3<43,\"\",IF(C$7<43,IF(C$4+C$7>=43,\"3rd in group\",\"Group stage\"),\"1/32 final\"))","v":""}]
[{"$f":"IF(C$3<44,\"\",IF(C$7<44,IF(C$4+C$7>=44,C$7+1,C$7+C$4+1),33))","v":""},null,null,null,{"$f":"IF(C$3<44,\"\",IF(C$7<44,IF(C$4+C$7>=44,\"3rd in group\",\"Group stage\"),\"1/32 final\"))","v":""}]
[{"$f":"IF(C$3<45,\"\",IF(C$7<45,IF(C$4+C$7>=45,C$7+1,C$7+C$4+1),33))","v":""},null,null,null,{"$f":"IF(C$3<45,\"\",IF(C$7<45,IF(C$4+C$7>=45,\"3rd in group\",\"Group stage\"),\"1/32 final\"))","v":""}]
[{"$f":"IF(C$3<46,\"\",IF(C$7<46,IF(C$4+C$7>=46,C$7+1,C$7+C$4+1),33))","v":""},null,null,null,{"$f":"IF(C$3<46,\"\",IF(C$7<46,IF(C$4+C$7>=46,\"3rd in group\",\"Group stage\"),\"1/32 final\"))","v":""}]
[{"$f":"IF(C$3<47,\"\",IF(C$7<47,IF(C$4+C$7>=47,C$7+1,C$7+C$4+1),33))","v":""},null,null,null,{"$f":"IF(C$3<47,\"\",IF(C$7<47,IF(C$4+C$7>=47,\"3rd in group\",\"Group stage\"),\"1/32 final\"))","v":""}]
[{"$f":"IF(C$3<48,\"\",IF(C$7<48,IF(C$4+C$7>=48,C$7+1,C$7+C$4+1),33))","v":""},null,null,null,{"$f":"IF(C$3<48,\"\",IF(C$7<48,IF(C$4+C$7>=48,\"3rd in group\",\"Group stage\"),\"1/32 final\"))","v":""}]
[{"$f":"IF(C$3<49,\"\",IF(C$7<49,IF(C$4+C$7>=49,C$7+1,C$7+C$4+1),33))","v":""},null,null,null,{"$f":"IF(C$3<49,\"\",IF(C$7<49,IF(C$4+C$7>=49,\"3rd in group\",\"Group stage\"),\"1/32 final\"))","v":""}]
[{"$f":"IF(C$3<50,\"\",IF(C$7<50,IF(C$4+C$7>=50,C$7+1,C$7+C$4+1),33))","v":""},null,null,null,{"$f":"IF(C$3<50,\"\",IF(C$7<50,IF(C$4+C$7>=50,\"3rd in group\",\"Group stage\"),\"1/32 final\"))","v":""}]
[{"$f":"IF(C$3<51,\"\",IF(C$7<51,IF(C$4+C$7>=51,C$7+1,C$7+C$4+1),33))","v":""},null,null,null,{"$f":"IF(C$3<51,\"\",IF(C$7<51,IF(C$4+C$7>=51,\"3rd in group\",\"Group stage\"),\"1/32 final\"))","v":""}]
[{"$f":"IF(C$3<52,\"\",IF(C$7<52,IF(C$4+C$7>=52,C$7+1,C$7+C$4+1),33))","v":""},null,null,null,{"$f":"IF(C$3<52,\"\",IF(C$7<52,IF(C$4+C$7>=52,\"3rd in group\",\"Group stage\"),\"1/32 final\"))","v":""}]
[{"$f":"IF(C$3<53,\"\",IF(C$7<53,IF(C$4+C$7>=53,C$7+1,C$7+C$4+1),33))","v":""},null,null,null,{"$f":"IF(C$3<53,\"\",IF(C$7<53,IF(C$4+C$7>=53,\"3rd in group\",\"Group stage\"),\"1/32 final\"))","v":""}]
[{"$f":"IF(C$3<54,\"\",IF(C$7<54,IF(C$4+C$7>=54,C$7+1,C$7+C$4+1),33))","v":""},null,null,null,{"$f":"IF(C$3<54,\"\",IF(C$7<54,IF(C$4+C$7>=54,\"3rd in group\",\"Group stage\"),\"1/32 final\"))","v":""}]
[{"$f":"IF(C$3<55,\"\",IF(C$7<55,IF(C$4+C$7>=55,C$7+1,C$7+C$4+1),33))","v":""},null,null,null,{"$f":"IF(C$3<55,\"\",IF(C$7<55,IF(C$4+C$7>=55,\"3rd in group\",\"Group stage\"),\"1/32 final\"))","v":""}]
[{"$f":"IF(C$3<56,\"\",IF(C$7<56,IF(C$4+C$7>=56,C$7+1,C$7+C$4+1),33))","v":""},null,null,null,{"$f":"IF(C$3<56,\"\",IF(C$7<56,IF(C$4+C$7>=56,\"3rd in group\",\"Group stage\"),\"1/32 final\"))","v":""}]
[{"$f":"IF(C$3<57,\"\",IF(C$7<57,IF(C$4+C$7>=57,C$7+1,C$7+C$4+1),33))","v":""},null,null,null,{"$f":"IF(C$3<57,\"\",IF(C$7<57,IF(C$4+C$7>=57,\"3rd in group\",\"Group stage\"),\"1/32 final\"))","v":""}]
[{"$f":"IF(C$3<58,\"\",IF(C$7<58,IF(C$4+C$7>=58,C$7+1,C$7+C$4+1),33))","v":""},null,null,null,{"$f":"IF(C$3<58,\"\",IF(C$7<58,IF(C$4+C$7>=58,\"3rd in group\",\"Group stage\"),\"1/32 final\"))","v":""}]
[{"$f":"IF(C$3<59,\"\",IF(C$7<59,IF(C$4+C$7>=59,C$7+1,C$7+C$4+1),33))","v":""},null,null,null,{"$f":"IF(C$3<59,\"\",IF(C$7<59,IF(C$4+C$7>=59,\"3rd in group\",\"Group stage\"),\"1/32 final\"))","v":""}]
[{"$f":"IF(C$3<60,\"\",IF(C$7<60,IF(C$4+C$7>=60,C$7+1,C$7+C$4+1),33))","v":""},null,null,null,{"$f":"IF(C$3<60,\"\",IF(C$7<60,IF(C$4+C$7>=60,\"3rd in group\",\"Group stage\"),\"1/32 final\"))","v":""}]
[{"$f":"IF(C$3<61,\"\",IF(C$7<61,IF(C$4+C$7>=61,C$7+1,C$7+C$4+1),33))","v":""},null,null,null,{"$f":"IF(C$3<61,\"\",IF(C$7<61,IF(C$4+C$7>=61,\"3rd in group\",\"Group stage\"),\"1/32 final\"))","v":""}]
[{"$f":"IF(C$3<62,\"\",IF(C$7<62,IF(C$4+C$7>=62,C$7+1,C$7+C$4+1),33))","v":""},null,null,null,{"$f":"IF(C$3<62,\"\",IF(C$7<62,IF(C$4+C$7>=62,\"3rd in group\",\"Group stage\"),\"1/32 final\"))","v":""}]
[{"$f":"IF(C$3<63,\"\",IF(C$7<63,IF(C$4+C$7>=63,C$7+1,C$7+C$4+1),33))","v":""},null,null,null,{"$f":"IF(C$3<63,\"\",IF(C$7<63,IF(C$4+C$7>=63,\"3rd in group\",\"Group stage\"),\"1/32 final\"))","v":""}]
[{"$f":"IF(C$3<64,\"\",IF(C$7<64,IF(C$4+C$7>=64,C$7+1,C$7+C$4+1),33))","v":""},null,null,null,{"$f":"IF(C$3<64,\"\",IF(C$7<64,IF(C$4+C$7>=64,\"3rd in group\",\"Group stage\"),\"1/32 final\"))","v":""}]

{"sheet":"Female O35","index":6,"n_rows":73,"n_cols":5,"rows_kept":73,"cut":false,"hidden":false,"merged":[[0,0,0,4]]}
["Female singles: Seniors 35+"]
[]
[null,"Number of players:",16]
[null,"Number of groups :",{"$f":"IF(C3<6,1,IF(C3<11,2,IF(C3=11,3,INT(C3/4))))","v":4}]
[null,"Tournament scheme:",{"$f":"CONCATENATE(IF(C3<6,CONCATENATE(\"1*\",C3),\"\"),IF(C3=6,\"2*3\",\"\"),IF(C3=7,\"1*4 + 1*3\",\"\"),IF(C3=11,\"2*4 + 1*3\",\"\"),IF(OR(C3=15,C3=10),CONCATENATE(C3/5,\"*5\"),\"\"),IF(OR(C3<=7,C3=10,C3=11,C3=15),\"\",CONCATENATE(INT(C3/4)-MOD(C3,4),\"*4\",IF(MOD(C3,4)=0,\"\",CONCATENATE(\" + \",MOD(C3,4),\"*5\")))))","v":"4*4"}]
[null,"Qualification:",{"$f":"IF(C3>=6,\"2 players per group\",\"NA\")","v":"2 players per group"}]
[null,"Nb of qualified players :",{"$f":"IF(C3<6,\"NA\",IF(C3<11,4,IF(C3=11,6,INT(C3/4)*2)))","v":8}]
[]
["Rank","Family name","First-name","Country","Reached stage"]
[1,null,null,null,{"$f":"IF(C$3<6,\"Group stage\",\"Final\")","v":"Final"}]
[2,null,null,null,"Final"]
[3,null,null,null,{"$f":"IF(C$3<6,\"Group stage\",\"1/2 final\")","v":"1/2 final"}]
[{"$f":"IF(C$3<6,4,3)","v":3},null,null,null,"1/2 final"]
[{"$f":"IF(C$3<5,\"\",5)","v":5},null,null,null,{"$f":"IF(C$3<5,\"\",IF(C$3=5,\"Group stage\",IF(C$7<5,\"3rd in group\",\"1/4 final\")))","v":"1/4 final"}]
[{"$f":"IF(C$3<6,\"\",5)","v":5},null,null,null,{"$f":"IF(C$3<6,\"\",IF(C$7<6,\"3rd in group\",\"1/4 final\"))","v":"1/4 final"}]
[{"$f":"IF(C$3<7,\"\",IF(C$7<7,IF(C$4+C$7>=7,C$7+1,C$7+C$4+1),5))","v":5},null,null,null,{"$f":"IF(C$3<7,\"\",IF(C$7<7,IF(C$4+C$7>=7,\"3rd in group\",\"Group stage\"),\"1/4 final\"))","v":"1/4 final"}]
[{"$f":"IF(C$3<8,\"\",IF(C$7<8,IF(C$4+C$7>=8,C$7+1,C$7+C$4+1),5))","v":5},null,null,null,{"$f":"IF(C$3<8,\"\",IF(C$7<8,IF(C$4+C$7>=8,\"3rd in group\",\"Group stage\"),\"1/4 final\"))","v":"1/4 final"}]
[{"$f":"IF(C$3<9,\"\",IF(C$7<9,IF(C$4+C$7>=9,C$7+1,C$7+C$4+1),9))","v":9},null,null,null,{"$f":"IF(C$3<9,\"\",IF(C$7<9,IF(C$4+C$7>=9,\"3rd in group\",\"Group stage\"),\"1/8 final\"))","v":"3rd in group"}]
[{"$f":"IF(C$3<10,\"\",IF(C$7<10,IF(C$4+C$7>=10,C$7+1,C$7+C$4+1),9))","v":9},null,null,null,{"$f":"IF(C$3<10,\"\",IF(C$7<10,IF(C$4+C$7>=10,\"3rd in group\",\"Group stage\"),\"1/8 final\"))","v":"3rd in group"}]
[{"$f":"IF(C$3<11,\"\",IF(C$7<11,IF(C$4+C$7>=11,C$7+1,C$7+C$4+1),9))","v":9},null,null,null,{"$f":"IF(C$3<11,\"\",IF(C$7<11,IF(C$4+C$7>=11,\"3rd in group\",\"Group stage\"),\"1/8 final\"))","v":"3rd in group"}]
[{"$f":"IF(C$3<12,\"\",IF(C$7<12,IF(C$4+C$7>=12,C$7+1,C$7+C$4+1),9))","v":9},null,null,null,{"$f":"IF(C$3<12,\"\",IF(C$7<12,IF(C$4+C$7>=12,\"3rd in group\",\"Group stage\"),\"1/8 final\"))","v":"3rd in group"}]
[{"$f":"IF(C$3<13,\"\",IF(C$7<13,IF(C$4+C$7>=13,C$7+1,C$7+C$4+1),9))","v":13},null,null,null,{"$f":"IF(C$3<13,\"\",IF(C$7<13,IF(C$4+C$7>=13,\"3rd in group\",\"Group stage\"),\"1/8 final\"))","v":"Group stage"}]
[{"$f":"IF(C$3<14,\"\",IF(C$7<14,IF(C$4+C$7>=14,C$7+1,C$7+C$4+1),9))","v":13},null,null,null,{"$f":"IF(C$3<14,\"\",IF(C$7<14,IF(C$4+C$7>=14,\"3rd in group\",\"Group stage\"),\"1/8 final\"))","v":"Group stage"}]
[{"$f":"IF(C$3<15,\"\",IF(C$7<15,IF(C$4+C$7>=15,C$7+1,C$7+C$4+1),9))","v":13},null,null,null,{"$f":"IF(C$3<15,\"\",IF(C$7<15,IF(C$4+C$7>=15,\"3rd in group\",\"Group stage\"),\"1/8 final\"))","v":"Group stage"}]
[{"$f":"IF(C$3<16,\"\",IF(C$7<16,IF(C$4+C$7>=16,C$7+1,C$7+C$4+1),9))","v":13},null,null,null,{"$f":"IF(C$3<16,\"\",IF(C$7<16,IF(C$4+C$7>=16,\"3rd in group\",\"Group stage\"),\"1/8 final\"))","v":"Group stage"}]
[{"$f":"IF(C$3<17,\"\",IF(C$7<17,IF(C$4+C$7>=17,C$7+1,C$7+C$4+1),17))","v":""},null,null,null,{"$f":"IF(C$3<17,\"\",IF(C$7<17,IF(C$4+C$7>=17,\"3rd in group\",\"Group stage\"),\"1/16 final\"))","v":""}]
[{"$f":"IF(C$3<18,\"\",IF(C$7<18,IF(C$4+C$7>=18,C$7+1,C$7+C$4+1),17))","v":""},null,null,null,{"$f":"IF(C$3<18,\"\",IF(C$7<18,IF(C$4+C$7>=18,\"3rd in group\",\"Group stage\"),\"1/16 final\"))","v":""}]
[{"$f":"IF(C$3<19,\"\",IF(C$7<19,IF(C$4+C$7>=19,C$7+1,C$7+C$4+1),17))","v":""},null,null,null,{"$f":"IF(C$3<19,\"\",IF(C$7<19,IF(C$4+C$7>=19,\"3rd in group\",\"Group stage\"),\"1/16 final\"))","v":""}]
[{"$f":"IF(C$3<20,\"\",IF(C$7<20,IF(C$4+C$7>=20,C$7+1,C$7+C$4+1),17))","v":""},null,null,null,{"$f":"IF(C$3<20,\"\",IF(C$7<20,IF(C$4+C$7>=20,\"3rd in group\",\"Group stage\"),\"1/16 final\"))","v":""}]
[{"$f":"IF(C$3<21,\"\",IF(C$7<21,IF(C$4+C$7>=21,C$7+1,C$7+C$4+1),17))","v":""},null,null,null,{"$f":"IF(C$3<21,\"\",IF(C$7<21,IF(C$4+C$7>=21,\"3rd in group\",\"Group stage\"),\"1/16 final\"))","v":""}]
[{"$f":"IF(C$3<22,\"\",IF(C$7<22,IF(C$4+C$7>=22,C$7+1,C$7+C$4+1),17))","v":""},null,null,null,{"$f":"IF(C$3<22,\"\",IF(C$7<22,IF(C$4+C$7>=22,\"3rd in group\",\"Group stage\"),\"1/16 final\"))","v":""}]
[{"$f":"IF(C$3<23,\"\",IF(C$7<23,IF(C$4+C$7>=23,C$7+1,C$7+C$4+1),17))","v":""},null,null,null,{"$f":"IF(C$3<23,\"\",IF(C$7<23,IF(C$4+C$7>=23,\"3rd in group\",\"Group stage\"),\"1/16 final\"))","v":""}]
[{"$f":"IF(C$3<24,\"\",IF(C$7<24,IF(C$4+C$7>=24,C$7+1,C$7+C$4+1),17))","v":""},null,null,null,{"$f":"IF(C$3<24,\"\",IF(C$7<24,IF(C$4+C$7>=24,\"3rd in group\",\"Group stage\"),\"1/16 final\"))","v":""}]
[{"$f":"IF(C$3<25,\"\",IF(C$7<25,IF(C$4+C$7>=25,C$7+1,C$7+C$4+1),17))","v":""},null,null,null,{"$f":"IF(C$3<25,\"\",IF(C$7<25,IF(C$4+C$7>=25,\"3rd in group\",\"Group stage\"),\"1/16 final\"))","v":""}]
[{"$f":"IF(C$3<26,\"\",IF(C$7<26,IF(C$4+C$7>=26,C$7+1,C$7+C$4+1),17))","v":""},null,null,null,{"$f":"IF(C$3<26,\"\",IF(C$7<26,IF(C$4+C$7>=26,\"3rd in group\",\"Group stage\"),\"1/16 final\"))","v":""}]
[{"$f":"IF(C$3<27,\"\",IF(C$7<27,IF(C$4+C$7>=27,C$7+1,C$7+C$4+1),17))","v":""},null,null,null,{"$f":"IF(C$3<27,\"\",IF(C$7<27,IF(C$4+C$7>=27,\"3rd in group\",\"Group stage\"),\"1/16 final\"))","v":""}]
[{"$f":"IF(C$3<28,\"\",IF(C$7<28,IF(C$4+C$7>=28,C$7+1,C$7+C$4+1),17))","v":""},null,null,null,{"$f":"IF(C$3<28,\"\",IF(C$7<28,IF(C$4+C$7>=28,\"3rd in group\",\"Group stage\"),\"1/16 final\"))","v":""}]
[{"$f":"IF(C$3<29,\"\",IF(C$7<29,IF(C$4+C$7>=29,C$7+1,C$7+C$4+1),17))","v":""},null,null,null,{"$f":"IF(C$3<29,\"\",IF(C$7<29,IF(C$4+C$7>=29,\"3rd in group\",\"Group stage\"),\"1/16 final\"))","v":""}]
[{"$f":"IF(C$3<30,\"\",IF(C$7<30,IF(C$4+C$7>=30,C$7+1,C$7+C$4+1),17))","v":""},null,null,null,{"$f":"IF(C$3<30,\"\",IF(C$7<30,IF(C$4+C$7>=30,\"3rd in group\",\"Group stage\"),\"1/16 final\"))","v":""}]
[{"$f":"IF(C$3<31,\"\",IF(C$7<31,IF(C$4+C$7>=31,C$7+1,C$7+C$4+1),17))","v":""},null,null,null,{"$f":"IF(C$3<31,\"\",IF(C$7<31,IF(C$4+C$7>=31,\"3rd in group\",\"Group stage\"),\"1/16 final\"))","v":""}]
[{"$f":"IF(C$3<32,\"\",IF(C$7<32,IF(C$4+C$7>=32,C$7+1,C$7+C$4+1),17))","v":""},null,null,null,{"$f":"IF(C$3<32,\"\",IF(C$7<32,IF(C$4+C$7>=32,\"3rd in group\",\"Group stage\"),\"1/16 final\"))","v":""}]
[{"$f":"IF(C$3<33,\"\",IF(C$7<33,IF(C$4+C$7>=33,C$7+1,C$7+C$4+1),33))","v":""},null,null,null,{"$f":"IF(C$3<33,\"\",IF(C$7<33,IF(C$4+C$7>=33,\"3rd in group\",\"Group stage\"),\"1/32 final\"))","v":""}]
[{"$f":"IF(C$3<34,\"\",IF(C$7<34,IF(C$4+C$7>=34,C$7+1,C$7+C$4+1),33))","v":""},null,null,null,{"$f":"IF(C$3<34,\"\",IF(C$7<34,IF(C$4+C$7>=34,\"3rd in group\",\"Group stage\"),\"1/32 final\"))","v":""}]
[{"$f":"IF(C$3<35,\"\",IF(C$7<35,IF(C$4+C$7>=35,C$7+1,C$7+C$4+1),33))","v":""},null,null,null,{"$f":"IF(C$3<35,\"\",IF(C$7<35,IF(C$4+C$7>=35,\"3rd in group\",\"Group stage\"),\"1/32 final\"))","v":""}]
[{"$f":"IF(C$3<36,\"\",IF(C$7<36,IF(C$4+C$7>=36,C$7+1,C$7+C$4+1),33))","v":""},null,null,null,{"$f":"IF(C$3<36,\"\",IF(C$7<36,IF(C$4+C$7>=36,\"3rd in group\",\"Group stage\"),\"1/32 final\"))","v":""}]
[{"$f":"IF(C$3<37,\"\",IF(C$7<37,IF(C$4+C$7>=37,C$7+1,C$7+C$4+1),33))","v":""},null,null,null,{"$f":"IF(C$3<37,\"\",IF(C$7<37,IF(C$4+C$7>=37,\"3rd in group\",\"Group stage\"),\"1/32 final\"))","v":""}]
[{"$f":"IF(C$3<38,\"\",IF(C$7<38,IF(C$4+C$7>=38,C$7+1,C$7+C$4+1),33))","v":""},null,null,null,{"$f":"IF(C$3<38,\"\",IF(C$7<38,IF(C$4+C$7>=38,\"3rd in group\",\"Group stage\"),\"1/32 final\"))","v":""}]
[{"$f":"IF(C$3<39,\"\",IF(C$7<39,IF(C$4+C$7>=39,C$7+1,C$7+C$4+1),33))","v":""},null,null,null,{"$f":"IF(C$3<39,\"\",IF(C$7<39,IF(C$4+C$7>=39,\"3rd in group\",\"Group stage\"),\"1/32 final\"))","v":""}]
[{"$f":"IF(C$3<40,\"\",IF(C$7<40,IF(C$4+C$7>=40,C$7+1,C$7+C$4+1),33))","v":""},null,null,null,{"$f":"IF(C$3<40,\"\",IF(C$7<40,IF(C$4+C$7>=40,\"3rd in group\",\"Group stage\"),\"1/32 final\"))","v":""}]
[{"$f":"IF(C$3<41,\"\",IF(C$7<41,IF(C$4+C$7>=41,C$7+1,C$7+C$4+1),33))","v":""},null,null,null,{"$f":"IF(C$3<41,\"\",IF(C$7<41,IF(C$4+C$7>=41,\"3rd in group\",\"Group stage\"),\"1/32 final\"))","v":""}]
[{"$f":"IF(C$3<42,\"\",IF(C$7<42,IF(C$4+C$7>=42,C$7+1,C$7+C$4+1),33))","v":""},null,null,null,{"$f":"IF(C$3<42,\"\",IF(C$7<42,IF(C$4+C$7>=42,\"3rd in group\",\"Group stage\"),\"1/32 final\"))","v":""}]
[{"$f":"IF(C$3<43,\"\",IF(C$7<43,IF(C$4+C$7>=43,C$7+1,C$7+C$4+1),33))","v":""},null,null,null,{"$f":"IF(C$3<43,\"\",IF(C$7<43,IF(C$4+C$7>=43,\"3rd in group\",\"Group stage\"),\"1/32 final\"))","v":""}]
[{"$f":"IF(C$3<44,\"\",IF(C$7<44,IF(C$4+C$7>=44,C$7+1,C$7+C$4+1),33))","v":""},null,null,null,{"$f":"IF(C$3<44,\"\",IF(C$7<44,IF(C$4+C$7>=44,\"3rd in group\",\"Group stage\"),\"1/32 final\"))","v":""}]
[{"$f":"IF(C$3<45,\"\",IF(C$7<45,IF(C$4+C$7>=45,C$7+1,C$7+C$4+1),33))","v":""},null,null,null,{"$f":"IF(C$3<45,\"\",IF(C$7<45,IF(C$4+C$7>=45,\"3rd in group\",\"Group stage\"),\"1/32 final\"))","v":""}]
[{"$f":"IF(C$3<46,\"\",IF(C$7<46,IF(C$4+C$7>=46,C$7+1,C$7+C$4+1),33))","v":""},null,null,null,{"$f":"IF(C$3<46,\"\",IF(C$7<46,IF(C$4+C$7>=46,\"3rd in group\",\"Group stage\"),\"1/32 final\"))","v":""}]
[{"$f":"IF(C$3<47,\"\",IF(C$7<47,IF(C$4+C$7>=47,C$7+1,C$7+C$4+1),33))","v":""},null,null,null,{"$f":"IF(C$3<47,\"\",IF(C$7<47,IF(C$4+C$7>=47,\"3rd in group\",\"Group stage\"),\"1/32 final\"))","v":""}]
[{"$f":"IF(C$3<48,\"\",IF(C$7<48,IF(C$4+C$7>=48,C$7+1,C$7+C$4+1),33))","v":""},null,null,null,{"$f":"IF(C$3<48,\"\",IF(C$7<48,IF(C$4+C$7>=48,\"3rd in group\",\"Group stage\"),\"1/32 final\"))","v":""}]
[{"$f":"IF(C$3<49,\"\",IF(C$7<49,IF(C$4+C$7>=49,C$7+1,C$7+C$4+1),33))","v":""},null,null,null,{"$f":"IF(C$3<49,\"\",IF(C$7<49,IF(C$4+C$7>=49,\"3rd in group\",\"Group stage\"),\"1/32 final\"))","v":""}]
[{"$f":"IF(C$3<50,\"\",IF(C$7<50,IF(C$4+C$7>=50,C$7+1,C$7+C$4+1),33))","v":""},null,null,null,{"$f":"IF(C$3<50,\"\",IF(C$7<50,IF(C$4+C$7>=50,\"3rd in group\",\"Group stage\"),\"1/32 final\"))","v":""}]
[{"$f":"IF(C$3<51,\"\",IF(C$7<51,IF(C$4+C$7>=51,C$7+1,C$7+C$4+1),33))","v":""},null,null,null,{"$f":"IF(C$3<51,\"\",IF(C$7<51,IF(C$4+C$7>=51,\"3rd in group\",\"Group stage\"),\"1/32 final\"))","v":""}]
[{"$f":"IF(C$3<52,\"\",IF(C$7<52,IF(C$4+C$7>=52,C$7+1,C$7+C$4+1),33))","v":""},null,null,null,{"$f":"IF(C$3<52,\"\",IF(C$7<52,IF(C$4+C$7>=52,\"3rd in group\",\"Group stage\"),\"1/32 final\"))","v":""}]
[{"$f":"IF(C$3<53,\"\",IF(C$7<53,IF(C$4+C$7>=53,C$7+1,C$7+C$4+1),33))","v":""},null,null,null,{"$f":"IF(C$3<53,\"\",IF(C$7<53,IF(C$4+C$7>=53,\"3rd in group\",\"Group stage\"),\"1/32 final\"))","v":""}]
[{"$f":"IF(C$3<54,\"\",IF(C$7<54,IF(C$4+C$7>=54,C$7+1,C$7+C$4+1),33))","v":""},null,null,null,{"$f":"IF(C$3<54,\"\",IF(C$7<54,IF(C$4+C$7>=54,\"3rd in group\",\"Group stage\"),\"1/32 final\"))","v":""}]
[{"$f":"IF(C$3<55,\"\",IF(C$7<55,IF(C$4+C$7>=55,C$7+1,C$7+C$4+1),33))","v":""},null,null,null,{"$f":"IF(C$3<55,\"\",IF(C$7<55,IF(C$4+C$7>=55,\"3rd in group\",\"Group stage\"),\"1/32 final\"))","v":""}]
[{"$f":"IF(C$3<56,\"\",IF(C$7<56,IF(C$4+C$7>=56,C$7+1,C$7+C$4+1),33))","v":""},null,null,null,{"$f":"IF(C$3<56,\"\",IF(C$7<56,IF(C$4+C$7>=56,\"3rd in group\",\"Group stage\"),\"1/32 final\"))","v":""}]
[{"$f":"IF(C$3<57,\"\",IF(C$7<57,IF(C$4+C$7>=57,C$7+1,C$7+C$4+1),33))","v":""},null,null,null,{"$f":"IF(C$3<57,\"\",IF(C$7<57,IF(C$4+C$7>=57,\"3rd in group\",\"Group stage\"),\"1/32 final\"))","v":""}]
[{"$f":"IF(C$3<58,\"\",IF(C$7<58,IF(C$4+C$7>=58,C$7+1,C$7+C$4+1),33))","v":""},null,null,null,{"$f":"IF(C$3<58,\"\",IF(C$7<58,IF(C$4+C$7>=58,\"3rd in group\",\"Group stage\"),\"1/32 final\"))","v":""}]
[{"$f":"IF(C$3<59,\"\",IF(C$7<59,IF(C$4+C$7>=59,C$7+1,C$7+C$4+1),33))","v":""},null,null,null,{"$f":"IF(C$3<59,\"\",IF(C$7<59,IF(C$4+C$7>=59,\"3rd in group\",\"Group stage\"),\"1/32 final\"))","v":""}]
[{"$f":"IF(C$3<60,\"\",IF(C$7<60,IF(C$4+C$7>=60,C$7+1,C$7+C$4+1),33))","v":""},null,null,null,{"$f":"IF(C$3<60,\"\",IF(C$7<60,IF(C$4+C$7>=60,\"3rd in group\",\"Group stage\"),\"1/32 final\"))","v":""}]
[{"$f":"IF(C$3<61,\"\",IF(C$7<61,IF(C$4+C$7>=61,C$7+1,C$7+C$4+1),33))","v":""},null,null,null,{"$f":"IF(C$3<61,\"\",IF(C$7<61,IF(C$4+C$7>=61,\"3rd in group\",\"Group stage\"),\"1/32 final\"))","v":""}]
[{"$f":"IF(C$3<62,\"\",IF(C$7<62,IF(C$4+C$7>=62,C$7+1,C$7+C$4+1),33))","v":""},null,null,null,{"$f":"IF(C$3<62,\"\",IF(C$7<62,IF(C$4+C$7>=62,\"3rd in group\",\"Group stage\"),\"1/32 final\"))","v":""}]
[{"$f":"IF(C$3<63,\"\",IF(C$7<63,IF(C$4+C$7>=63,C$7+1,C$7+C$4+1),33))","v":""},null,null,null,{"$f":"IF(C$3<63,\"\",IF(C$7<63,IF(C$4+C$7>=63,\"3rd in group\",\"Group stage\"),\"1/32 final\"))","v":""}]
[{"$f":"IF(C$3<64,\"\",IF(C$7<64,IF(C$4+C$7>=64,C$7+1,C$7+C$4+1),33))","v":""},null,null,null,{"$f":"IF(C$3<64,\"\",IF(C$7<64,IF(C$4+C$7>=64,\"3rd in group\",\"Group stage\"),\"1/32 final\"))","v":""}]

{"sheet":"Female U18","index":7,"n_rows":73,"n_cols":5,"rows_kept":73,"cut":false,"hidden":false,"merged":[[0,0,0,4]]}
["Female singles: Juniors U18"]
[]
[null,"Number of players:",16]
[null,"Number of groups :",{"$f":"IF(C3<6,1,IF(C3<11,2,IF(C3=11,3,INT(C3/4))))","v":4}]
[null,"Tournament scheme:",{"$f":"CONCATENATE(IF(C3<6,CONCATENATE(\"1*\",C3),\"\"),IF(C3=6,\"2*3\",\"\"),IF(C3=7,\"1*4 + 1*3\",\"\"),IF(C3=11,\"2*4 + 1*3\",\"\"),IF(OR(C3=15,C3=10),CONCATENATE(C3/5,\"*5\"),\"\"),IF(OR(C3<=7,C3=10,C3=11,C3=15),\"\",CONCATENATE(INT(C3/4)-MOD(C3,4),\"*4\",IF(MOD(C3,4)=0,\"\",CONCATENATE(\" + \",MOD(C3,4),\"*5\")))))","v":"4*4"}]
[null,"Qualification:",{"$f":"IF(C3>=6,\"2 players per group\",\"NA\")","v":"2 players per group"}]
[null,"Nb of qualified players :",{"$f":"IF(C3<6,\"NA\",IF(C3<11,4,IF(C3=11,6,INT(C3/4)*2)))","v":8}]
[]
["Rank","Family name","First-name","Country","Reached stage"]
[1,null,null,null,{"$f":"IF(C$3<6,\"Group stage\",\"Final\")","v":"Final"}]
[2,null,null,null,"Final"]
[3,null,null,null,{"$f":"IF(C$3<6,\"Group stage\",\"1/2 final\")","v":"1/2 final"}]
[{"$f":"IF(C$3<6,4,3)","v":3},null,null,null,"1/2 final"]
[{"$f":"IF(C$3<5,\"\",5)","v":5},null,null,null,{"$f":"IF(C$3<5,\"\",IF(C$3=5,\"Group stage\",IF(C$7<5,\"3rd in group\",\"1/4 final\")))","v":"1/4 final"}]
[{"$f":"IF(C$3<6,\"\",5)","v":5},null,null,null,{"$f":"IF(C$3<6,\"\",IF(C$7<6,\"3rd in group\",\"1/4 final\"))","v":"1/4 final"}]
[{"$f":"IF(C$3<7,\"\",IF(C$7<7,IF(C$4+C$7>=7,C$7+1,C$7+C$4+1),5))","v":5},null,null,null,{"$f":"IF(C$3<7,\"\",IF(C$7<7,IF(C$4+C$7>=7,\"3rd in group\",\"Group stage\"),\"1/4 final\"))","v":"1/4 final"}]
[{"$f":"IF(C$3<8,\"\",IF(C$7<8,IF(C$4+C$7>=8,C$7+1,C$7+C$4+1),5))","v":5},null,null,null,{"$f":"IF(C$3<8,\"\",IF(C$7<8,IF(C$4+C$7>=8,\"3rd in group\",\"Group stage\"),\"1/4 final\"))","v":"1/4 final"}]
[{"$f":"IF(C$3<9,\"\",IF(C$7<9,IF(C$4+C$7>=9,C$7+1,C$7+C$4+1),9))","v":9},null,null,null,{"$f":"IF(C$3<9,\"\",IF(C$7<9,IF(C$4+C$7>=9,\"3rd in group\",\"Group stage\"),\"1/8 final\"))","v":"3rd in group"}]
[{"$f":"IF(C$3<10,\"\",IF(C$7<10,IF(C$4+C$7>=10,C$7+1,C$7+C$4+1),9))","v":9},null,null,null,{"$f":"IF(C$3<10,\"\",IF(C$7<10,IF(C$4+C$7>=10,\"3rd in group\",\"Group stage\"),\"1/8 final\"))","v":"3rd in group"}]
[{"$f":"IF(C$3<11,\"\",IF(C$7<11,IF(C$4+C$7>=11,C$7+1,C$7+C$4+1),9))","v":9},null,null,null,{"$f":"IF(C$3<11,\"\",IF(C$7<11,IF(C$4+C$7>=11,\"3rd in group\",\"Group stage\"),\"1/8 final\"))","v":"3rd in group"}]
[{"$f":"IF(C$3<12,\"\",IF(C$7<12,IF(C$4+C$7>=12,C$7+1,C$7+C$4+1),9))","v":9},null,null,null,{"$f":"IF(C$3<12,\"\",IF(C$7<12,IF(C$4+C$7>=12,\"3rd in group\",\"Group stage\"),\"1/8 final\"))","v":"3rd in group"}]
[{"$f":"IF(C$3<13,\"\",IF(C$7<13,IF(C$4+C$7>=13,C$7+1,C$7+C$4+1),9))","v":13},null,null,null,{"$f":"IF(C$3<13,\"\",IF(C$7<13,IF(C$4+C$7>=13,\"3rd in group\",\"Group stage\"),\"1/8 final\"))","v":"Group stage"}]
[{"$f":"IF(C$3<14,\"\",IF(C$7<14,IF(C$4+C$7>=14,C$7+1,C$7+C$4+1),9))","v":13},null,null,null,{"$f":"IF(C$3<14,\"\",IF(C$7<14,IF(C$4+C$7>=14,\"3rd in group\",\"Group stage\"),\"1/8 final\"))","v":"Group stage"}]
[{"$f":"IF(C$3<15,\"\",IF(C$7<15,IF(C$4+C$7>=15,C$7+1,C$7+C$4+1),9))","v":13},null,null,null,{"$f":"IF(C$3<15,\"\",IF(C$7<15,IF(C$4+C$7>=15,\"3rd in group\",\"Group stage\"),\"1/8 final\"))","v":"Group stage"}]
[{"$f":"IF(C$3<16,\"\",IF(C$7<16,IF(C$4+C$7>=16,C$7+1,C$7+C$4+1),9))","v":13},null,null,null,{"$f":"IF(C$3<16,\"\",IF(C$7<16,IF(C$4+C$7>=16,\"3rd in group\",\"Group stage\"),\"1/8 final\"))","v":"Group stage"}]
[{"$f":"IF(C$3<17,\"\",IF(C$7<17,IF(C$4+C$7>=17,C$7+1,C$7+C$4+1),17))","v":""},null,null,null,{"$f":"IF(C$3<17,\"\",IF(C$7<17,IF(C$4+C$7>=17,\"3rd in group\",\"Group stage\"),\"1/16 final\"))","v":""}]
[{"$f":"IF(C$3<18,\"\",IF(C$7<18,IF(C$4+C$7>=18,C$7+1,C$7+C$4+1),17))","v":""},null,null,null,{"$f":"IF(C$3<18,\"\",IF(C$7<18,IF(C$4+C$7>=18,\"3rd in group\",\"Group stage\"),\"1/16 final\"))","v":""}]
[{"$f":"IF(C$3<19,\"\",IF(C$7<19,IF(C$4+C$7>=19,C$7+1,C$7+C$4+1),17))","v":""},null,null,null,{"$f":"IF(C$3<19,\"\",IF(C$7<19,IF(C$4+C$7>=19,\"3rd in group\",\"Group stage\"),\"1/16 final\"))","v":""}]
[{"$f":"IF(C$3<20,\"\",IF(C$7<20,IF(C$4+C$7>=20,C$7+1,C$7+C$4+1),17))","v":""},null,null,null,{"$f":"IF(C$3<20,\"\",IF(C$7<20,IF(C$4+C$7>=20,\"3rd in group\",\"Group stage\"),\"1/16 final\"))","v":""}]
[{"$f":"IF(C$3<21,\"\",IF(C$7<21,IF(C$4+C$7>=21,C$7+1,C$7+C$4+1),17))","v":""},null,null,null,{"$f":"IF(C$3<21,\"\",IF(C$7<21,IF(C$4+C$7>=21,\"3rd in group\",\"Group stage\"),\"1/16 final\"))","v":""}]
[{"$f":"IF(C$3<22,\"\",IF(C$7<22,IF(C$4+C$7>=22,C$7+1,C$7+C$4+1),17))","v":""},null,null,null,{"$f":"IF(C$3<22,\"\",IF(C$7<22,IF(C$4+C$7>=22,\"3rd in group\",\"Group stage\"),\"1/16 final\"))","v":""}]
[{"$f":"IF(C$3<23,\"\",IF(C$7<23,IF(C$4+C$7>=23,C$7+1,C$7+C$4+1),17))","v":""},null,null,null,{"$f":"IF(C$3<23,\"\",IF(C$7<23,IF(C$4+C$7>=23,\"3rd in group\",\"Group stage\"),\"1/16 final\"))","v":""}]
[{"$f":"IF(C$3<24,\"\",IF(C$7<24,IF(C$4+C$7>=24,C$7+1,C$7+C$4+1),17))","v":""},null,null,null,{"$f":"IF(C$3<24,\"\",IF(C$7<24,IF(C$4+C$7>=24,\"3rd in group\",\"Group stage\"),\"1/16 final\"))","v":""}]
[{"$f":"IF(C$3<25,\"\",IF(C$7<25,IF(C$4+C$7>=25,C$7+1,C$7+C$4+1),17))","v":""},null,null,null,{"$f":"IF(C$3<25,\"\",IF(C$7<25,IF(C$4+C$7>=25,\"3rd in group\",\"Group stage\"),\"1/16 final\"))","v":""}]
[{"$f":"IF(C$3<26,\"\",IF(C$7<26,IF(C$4+C$7>=26,C$7+1,C$7+C$4+1),17))","v":""},null,null,null,{"$f":"IF(C$3<26,\"\",IF(C$7<26,IF(C$4+C$7>=26,\"3rd in group\",\"Group stage\"),\"1/16 final\"))","v":""}]
[{"$f":"IF(C$3<27,\"\",IF(C$7<27,IF(C$4+C$7>=27,C$7+1,C$7+C$4+1),17))","v":""},null,null,null,{"$f":"IF(C$3<27,\"\",IF(C$7<27,IF(C$4+C$7>=27,\"3rd in group\",\"Group stage\"),\"1/16 final\"))","v":""}]
[{"$f":"IF(C$3<28,\"\",IF(C$7<28,IF(C$4+C$7>=28,C$7+1,C$7+C$4+1),17))","v":""},null,null,null,{"$f":"IF(C$3<28,\"\",IF(C$7<28,IF(C$4+C$7>=28,\"3rd in group\",\"Group stage\"),\"1/16 final\"))","v":""}]
[{"$f":"IF(C$3<29,\"\",IF(C$7<29,IF(C$4+C$7>=29,C$7+1,C$7+C$4+1),17))","v":""},null,null,null,{"$f":"IF(C$3<29,\"\",IF(C$7<29,IF(C$4+C$7>=29,\"3rd in group\",\"Group stage\"),\"1/16 final\"))","v":""}]
[{"$f":"IF(C$3<30,\"\",IF(C$7<30,IF(C$4+C$7>=30,C$7+1,C$7+C$4+1),17))","v":""},null,null,null,{"$f":"IF(C$3<30,\"\",IF(C$7<30,IF(C$4+C$7>=30,\"3rd in group\",\"Group stage\"),\"1/16 final\"))","v":""}]
[{"$f":"IF(C$3<31,\"\",IF(C$7<31,IF(C$4+C$7>=31,C$7+1,C$7+C$4+1),17))","v":""},null,null,null,{"$f":"IF(C$3<31,\"\",IF(C$7<31,IF(C$4+C$7>=31,\"3rd in group\",\"Group stage\"),\"1/16 final\"))","v":""}]
[{"$f":"IF(C$3<32,\"\",IF(C$7<32,IF(C$4+C$7>=32,C$7+1,C$7+C$4+1),17))","v":""},null,null,null,{"$f":"IF(C$3<32,\"\",IF(C$7<32,IF(C$4+C$7>=32,\"3rd in group\",\"Group stage\"),\"1/16 final\"))","v":""}]
[{"$f":"IF(C$3<33,\"\",IF(C$7<33,IF(C$4+C$7>=33,C$7+1,C$7+C$4+1),33))","v":""},null,null,null,{"$f":"IF(C$3<33,\"\",IF(C$7<33,IF(C$4+C$7>=33,\"3rd in group\",\"Group stage\"),\"1/32 final\"))","v":""}]
[{"$f":"IF(C$3<34,\"\",IF(C$7<34,IF(C$4+C$7>=34,C$7+1,C$7+C$4+1),33))","v":""},null,null,null,{"$f":"IF(C$3<34,\"\",IF(C$7<34,IF(C$4+C$7>=34,\"3rd in group\",\"Group stage\"),\"1/32 final\"))","v":""}]
[{"$f":"IF(C$3<35,\"\",IF(C$7<35,IF(C$4+C$7>=35,C$7+1,C$7+C$4+1),33))","v":""},null,null,null,{"$f":"IF(C$3<35,\"\",IF(C$7<35,IF(C$4+C$7>=35,\"3rd in group\",\"Group stage\"),\"1/32 final\"))","v":""}]
[{"$f":"IF(C$3<36,\"\",IF(C$7<36,IF(C$4+C$7>=36,C$7+1,C$7+C$4+1),33))","v":""},null,null,null,{"$f":"IF(C$3<36,\"\",IF(C$7<36,IF(C$4+C$7>=36,\"3rd in group\",\"Group stage\"),\"1/32 final\"))","v":""}]
[{"$f":"IF(C$3<37,\"\",IF(C$7<37,IF(C$4+C$7>=37,C$7+1,C$7+C$4+1),33))","v":""},null,null,null,{"$f":"IF(C$3<37,\"\",IF(C$7<37,IF(C$4+C$7>=37,\"3rd in group\",\"Group stage\"),\"1/32 final\"))","v":""}]
[{"$f":"IF(C$3<38,\"\",IF(C$7<38,IF(C$4+C$7>=38,C$7+1,C$7+C$4+1),33))","v":""},null,null,null,{"$f":"IF(C$3<38,\"\",IF(C$7<38,IF(C$4+C$7>=38,\"3rd in group\",\"Group stage\"),\"1/32 final\"))","v":""}]
[{"$f":"IF(C$3<39,\"\",IF(C$7<39,IF(C$4+C$7>=39,C$7+1,C$7+C$4+1),33))","v":""},null,null,null,{"$f":"IF(C$3<39,\"\",IF(C$7<39,IF(C$4+C$7>=39,\"3rd in group\",\"Group stage\"),\"1/32 final\"))","v":""}]
[{"$f":"IF(C$3<40,\"\",IF(C$7<40,IF(C$4+C$7>=40,C$7+1,C$7+C$4+1),33))","v":""},null,null,null,{"$f":"IF(C$3<40,\"\",IF(C$7<40,IF(C$4+C$7>=40,\"3rd in group\",\"Group stage\"),\"1/32 final\"))","v":""}]
[{"$f":"IF(C$3<41,\"\",IF(C$7<41,IF(C$4+C$7>=41,C$7+1,C$7+C$4+1),33))","v":""},null,null,null,{"$f":"IF(C$3<41,\"\",IF(C$7<41,IF(C$4+C$7>=41,\"3rd in group\",\"Group stage\"),\"1/32 final\"))","v":""}]
[{"$f":"IF(C$3<42,\"\",IF(C$7<42,IF(C$4+C$7>=42,C$7+1,C$7+C$4+1),33))","v":""},null,null,null,{"$f":"IF(C$3<42,\"\",IF(C$7<42,IF(C$4+C$7>=42,\"3rd in group\",\"Group stage\"),\"1/32 final\"))","v":""}]
[{"$f":"IF(C$3<43,\"\",IF(C$7<43,IF(C$4+C$7>=43,C$7+1,C$7+C$4+1),33))","v":""},null,null,null,{"$f":"IF(C$3<43,\"\",IF(C$7<43,IF(C$4+C$7>=43,\"3rd in group\",\"Group stage\"),\"1/32 final\"))","v":""}]
[{"$f":"IF(C$3<44,\"\",IF(C$7<44,IF(C$4+C$7>=44,C$7+1,C$7+C$4+1),33))","v":""},null,null,null,{"$f":"IF(C$3<44,\"\",IF(C$7<44,IF(C$4+C$7>=44,\"3rd in group\",\"Group stage\"),\"1/32 final\"))","v":""}]
[{"$f":"IF(C$3<45,\"\",IF(C$7<45,IF(C$4+C$7>=45,C$7+1,C$7+C$4+1),33))","v":""},null,null,null,{"$f":"IF(C$3<45,\"\",IF(C$7<45,IF(C$4+C$7>=45,\"3rd in group\",\"Group stage\"),\"1/32 final\"))","v":""}]
[{"$f":"IF(C$3<46,\"\",IF(C$7<46,IF(C$4+C$7>=46,C$7+1,C$7+C$4+1),33))","v":""},null,null,null,{"$f":"IF(C$3<46,\"\",IF(C$7<46,IF(C$4+C$7>=46,\"3rd in group\",\"Group stage\"),\"1/32 final\"))","v":""}]
[{"$f":"IF(C$3<47,\"\",IF(C$7<47,IF(C$4+C$7>=47,C$7+1,C$7+C$4+1),33))","v":""},null,null,null,{"$f":"IF(C$3<47,\"\",IF(C$7<47,IF(C$4+C$7>=47,\"3rd in group\",\"Group stage\"),\"1/32 final\"))","v":""}]
[{"$f":"IF(C$3<48,\"\",IF(C$7<48,IF(C$4+C$7>=48,C$7+1,C$7+C$4+1),33))","v":""},null,null,null,{"$f":"IF(C$3<48,\"\",IF(C$7<48,IF(C$4+C$7>=48,\"3rd in group\",\"Group stage\"),\"1/32 final\"))","v":""}]
[{"$f":"IF(C$3<49,\"\",IF(C$7<49,IF(C$4+C$7>=49,C$7+1,C$7+C$4+1),33))","v":""},null,null,null,{"$f":"IF(C$3<49,\"\",IF(C$7<49,IF(C$4+C$7>=49,\"3rd in group\",\"Group stage\"),\"1/32 final\"))","v":""}]
[{"$f":"IF(C$3<50,\"\",IF(C$7<50,IF(C$4+C$7>=50,C$7+1,C$7+C$4+1),33))","v":""},null,null,null,{"$f":"IF(C$3<50,\"\",IF(C$7<50,IF(C$4+C$7>=50,\"3rd in group\",\"Group stage\"),\"1/32 final\"))","v":""}]
[{"$f":"IF(C$3<51,\"\",IF(C$7<51,IF(C$4+C$7>=51,C$7+1,C$7+C$4+1),33))","v":""},null,null,null,{"$f":"IF(C$3<51,\"\",IF(C$7<51,IF(C$4+C$7>=51,\"3rd in group\",\"Group stage\"),\"1/32 final\"))","v":""}]
[{"$f":"IF(C$3<52,\"\",IF(C$7<52,IF(C$4+C$7>=52,C$7+1,C$7+C$4+1),33))","v":""},null,null,null,{"$f":"IF(C$3<52,\"\",IF(C$7<52,IF(C$4+C$7>=52,\"3rd in group\",\"Group stage\"),\"1/32 final\"))","v":""}]
[{"$f":"IF(C$3<53,\"\",IF(C$7<53,IF(C$4+C$7>=53,C$7+1,C$7+C$4+1),33))","v":""},null,null,null,{"$f":"IF(C$3<53,\"\",IF(C$7<53,IF(C$4+C$7>=53,\"3rd in group\",\"Group stage\"),\"1/32 final\"))","v":""}]
[{"$f":"IF(C$3<54,\"\",IF(C$7<54,IF(C$4+C$7>=54,C$7+1,C$7+C$4+1),33))","v":""},null,null,null,{"$f":"IF(C$3<54,\"\",IF(C$7<54,IF(C$4+C$7>=54,\"3rd in group\",\"Group stage\"),\"1/32 final\"))","v":""}]
[{"$f":"IF(C$3<55,\"\",IF(C$7<55,IF(C$4+C$7>=55,C$7+1,C$7+C$4+1),33))","v":""},null,null,null,{"$f":"IF(C$3<55,\"\",IF(C$7<55,IF(C$4+C$7>=55,\"3rd in group\",\"Group stage\"),\"1/32 final\"))","v":""}]
[{"$f":"IF(C$3<56,\"\",IF(C$7<56,IF(C$4+C$7>=56,C$7+1,C$7+C$4+1),33))","v":""},null,null,null,{"$f":"IF(C$3<56,\"\",IF(C$7<56,IF(C$4+C$7>=56,\"3rd in group\",\"Group stage\"),\"1/32 final\"))","v":""}]
[{"$f":"IF(C$3<57,\"\",IF(C$7<57,IF(C$4+C$7>=57,C$7+1,C$7+C$4+1),33))","v":""},null,null,null,{"$f":"IF(C$3<57,\"\",IF(C$7<57,IF(C$4+C$7>=57,\"3rd in group\",\"Group stage\"),\"1/32 final\"))","v":""}]
[{"$f":"IF(C$3<58,\"\",IF(C$7<58,IF(C$4+C$7>=58,C$7+1,C$7+C$4+1),33))","v":""},null,null,null,{"$f":"IF(C$3<58,\"\",IF(C$7<58,IF(C$4+C$7>=58,\"3rd in group\",\"Group stage\"),\"1/32 final\"))","v":""}]
[{"$f":"IF(C$3<59,\"\",IF(C$7<59,IF(C$4+C$7>=59,C$7+1,C$7+C$4+1),33))","v":""},null,null,null,{"$f":"IF(C$3<59,\"\",IF(C$7<59,IF(C$4+C$7>=59,\"3rd in group\",\"Group stage\"),\"1/32 final\"))","v":""}]
[{"$f":"IF(C$3<60,\"\",IF(C$7<60,IF(C$4+C$7>=60,C$7+1,C$7+C$4+1),33))","v":""},null,null,null,{"$f":"IF(C$3<60,\"\",IF(C$7<60,IF(C$4+C$7>=60,\"3rd in group\",\"Group stage\"),\"1/32 final\"))","v":""}]
[{"$f":"IF(C$3<61,\"\",IF(C$7<61,IF(C$4+C$7>=61,C$7+1,C$7+C$4+1),33))","v":""},null,null,null,{"$f":"IF(C$3<61,\"\",IF(C$7<61,IF(C$4+C$7>=61,\"3rd in group\",\"Group stage\"),\"1/32 final\"))","v":""}]
[{"$f":"IF(C$3<62,\"\",IF(C$7<62,IF(C$4+C$7>=62,C$7+1,C$7+C$4+1),33))","v":""},null,null,null,{"$f":"IF(C$3<62,\"\",IF(C$7<62,IF(C$4+C$7>=62,\"3rd in group\",\"Group stage\"),\"1/32 final\"))","v":""}]
[{"$f":"IF(C$3<63,\"\",IF(C$7<63,IF(C$4+C$7>=63,C$7+1,C$7+C$4+1),33))","v":""},null,null,null,{"$f":"IF(C$3<63,\"\",IF(C$7<63,IF(C$4+C$7>=63,\"3rd in group\",\"Group stage\"),\"1/32 final\"))","v":""}]
[{"$f":"IF(C$3<64,\"\",IF(C$7<64,IF(C$4+C$7>=64,C$7+1,C$7+C$4+1),33))","v":""},null,null,null,{"$f":"IF(C$3<64,\"\",IF(C$7<64,IF(C$4+C$7>=64,\"3rd in group\",\"Group stage\"),\"1/32 final\"))","v":""}]

{"sheet":"Male U18","index":8,"n_rows":73,"n_cols":5,"rows_kept":73,"cut":false,"hidden":false,"merged":[[0,0,0,4]]}
["Male singles: Juniors U18"]
[]
[null,"Number of players:",16]
[null,"Number of groups :",{"$f":"IF(C3<6,1,IF(C3<11,2,IF(C3=11,3,INT(C3/4))))","v":4}]
[null,"Tournament scheme:",{"$f":"CONCATENATE(IF(C3<6,CONCATENATE(\"1*\",C3),\"\"),IF(C3=6,\"2*3\",\"\"),IF(C3=7,\"1*4 + 1*3\",\"\"),IF(C3=11,\"2*4 + 1*3\",\"\"),IF(OR(C3=15,C3=10),CONCATENATE(C3/5,\"*5\"),\"\"),IF(OR(C3<=7,C3=10,C3=11,C3=15),\"\",CONCATENATE(INT(C3/4)-MOD(C3,4),\"*4\",IF(MOD(C3,4)=0,\"\",CONCATENATE(\" + \",MOD(C3,4),\"*5\")))))","v":"4*4"}]
[null,"Qualification:",{"$f":"IF(C3>=6,\"2 players per group\",\"NA\")","v":"2 players per group"}]
[null,"Nb of qualified players :",{"$f":"IF(C3<6,\"NA\",IF(C3<11,4,IF(C3=11,6,INT(C3/4)*2)))","v":8}]
[]
["Rank","Family name","First-name","Country","Reached stage"]
[1,null,null,null,{"$f":"IF(C$3<6,\"Group stage\",\"Final\")","v":"Final"}]
[2,null,null,null,"Final"]
[3,null,null,null,{"$f":"IF(C$3<6,\"Group stage\",\"1/2 final\")","v":"1/2 final"}]
[{"$f":"IF(C$3<6,4,3)","v":3},null,null,null,"1/2 final"]
[{"$f":"IF(C$3<5,\"\",5)","v":5},null,null,null,{"$f":"IF(C$3<5,\"\",IF(C$3=5,\"Group stage\",IF(C$7<5,\"3rd in group\",\"1/4 final\")))","v":"1/4 final"}]
[{"$f":"IF(C$3<6,\"\",5)","v":5},null,null,null,{"$f":"IF(C$3<6,\"\",IF(C$7<6,\"3rd in group\",\"1/4 final\"))","v":"1/4 final"}]
[{"$f":"IF(C$3<7,\"\",IF(C$7<7,IF(C$4+C$7>=7,C$7+1,C$7+C$4+1),5))","v":5},null,null,null,{"$f":"IF(C$3<7,\"\",IF(C$7<7,IF(C$4+C$7>=7,\"3rd in group\",\"Group stage\"),\"1/4 final\"))","v":"1/4 final"}]
[{"$f":"IF(C$3<8,\"\",IF(C$7<8,IF(C$4+C$7>=8,C$7+1,C$7+C$4+1),5))","v":5},null,null,null,{"$f":"IF(C$3<8,\"\",IF(C$7<8,IF(C$4+C$7>=8,\"3rd in group\",\"Group stage\"),\"1/4 final\"))","v":"1/4 final"}]
[{"$f":"IF(C$3<9,\"\",IF(C$7<9,IF(C$4+C$7>=9,C$7+1,C$7+C$4+1),9))","v":9},null,null,null,{"$f":"IF(C$3<9,\"\",IF(C$7<9,IF(C$4+C$7>=9,\"3rd in group\",\"Group stage\"),\"1/8 final\"))","v":"3rd in group"}]
[{"$f":"IF(C$3<10,\"\",IF(C$7<10,IF(C$4+C$7>=10,C$7+1,C$7+C$4+1),9))","v":9},null,null,null,{"$f":"IF(C$3<10,\"\",IF(C$7<10,IF(C$4+C$7>=10,\"3rd in group\",\"Group stage\"),\"1/8 final\"))","v":"3rd in group"}]
[{"$f":"IF(C$3<11,\"\",IF(C$7<11,IF(C$4+C$7>=11,C$7+1,C$7+C$4+1),9))","v":9},null,null,null,{"$f":"IF(C$3<11,\"\",IF(C$7<11,IF(C$4+C$7>=11,\"3rd in group\",\"Group stage\"),\"1/8 final\"))","v":"3rd in group"}]
[{"$f":"IF(C$3<12,\"\",IF(C$7<12,IF(C$4+C$7>=12,C$7+1,C$7+C$4+1),9))","v":9},null,null,null,{"$f":"IF(C$3<12,\"\",IF(C$7<12,IF(C$4+C$7>=12,\"3rd in group\",\"Group stage\"),\"1/8 final\"))","v":"3rd in group"}]
[{"$f":"IF(C$3<13,\"\",IF(C$7<13,IF(C$4+C$7>=13,C$7+1,C$7+C$4+1),9))","v":13},null,null,null,{"$f":"IF(C$3<13,\"\",IF(C$7<13,IF(C$4+C$7>=13,\"3rd in group\",\"Group stage\"),\"1/8 final\"))","v":"Group stage"}]
[{"$f":"IF(C$3<14,\"\",IF(C$7<14,IF(C$4+C$7>=14,C$7+1,C$7+C$4+1),9))","v":13},null,null,null,{"$f":"IF(C$3<14,\"\",IF(C$7<14,IF(C$4+C$7>=14,\"3rd in group\",\"Group stage\"),\"1/8 final\"))","v":"Group stage"}]
[{"$f":"IF(C$3<15,\"\",IF(C$7<15,IF(C$4+C$7>=15,C$7+1,C$7+C$4+1),9))","v":13},null,null,null,{"$f":"IF(C$3<15,\"\",IF(C$7<15,IF(C$4+C$7>=15,\"3rd in group\",\"Group stage\"),\"1/8 final\"))","v":"Group stage"}]
[{"$f":"IF(C$3<16,\"\",IF(C$7<16,IF(C$4+C$7>=16,C$7+1,C$7+C$4+1),9))","v":13},null,null,null,{"$f":"IF(C$3<16,\"\",IF(C$7<16,IF(C$4+C$7>=16,\"3rd in group\",\"Group stage\"),\"1/8 final\"))","v":"Group stage"}]
[{"$f":"IF(C$3<17,\"\",IF(C$7<17,IF(C$4+C$7>=17,C$7+1,C$7+C$4+1),17))","v":""},null,null,null,{"$f":"IF(C$3<17,\"\",IF(C$7<17,IF(C$4+C$7>=17,\"3rd in group\",\"Group stage\"),\"1/16 final\"))","v":""}]
[{"$f":"IF(C$3<18,\"\",IF(C$7<18,IF(C$4+C$7>=18,C$7+1,C$7+C$4+1),17))","v":""},null,null,null,{"$f":"IF(C$3<18,\"\",IF(C$7<18,IF(C$4+C$7>=18,\"3rd in group\",\"Group stage\"),\"1/16 final\"))","v":""}]
[{"$f":"IF(C$3<19,\"\",IF(C$7<19,IF(C$4+C$7>=19,C$7+1,C$7+C$4+1),17))","v":""},null,null,null,{"$f":"IF(C$3<19,\"\",IF(C$7<19,IF(C$4+C$7>=19,\"3rd in group\",\"Group stage\"),\"1/16 final\"))","v":""}]
[{"$f":"IF(C$3<20,\"\",IF(C$7<20,IF(C$4+C$7>=20,C$7+1,C$7+C$4+1),17))","v":""},null,null,null,{"$f":"IF(C$3<20,\"\",IF(C$7<20,IF(C$4+C$7>=20,\"3rd in group\",\"Group stage\"),\"1/16 final\"))","v":""}]
[{"$f":"IF(C$3<21,\"\",IF(C$7<21,IF(C$4+C$7>=21,C$7+1,C$7+C$4+1),17))","v":""},null,null,null,{"$f":"IF(C$3<21,\"\",IF(C$7<21,IF(C$4+C$7>=21,\"3rd in group\",\"Group stage\"),\"1/16 final\"))","v":""}]
[{"$f":"IF(C$3<22,\"\",IF(C$7<22,IF(C$4+C$7>=22,C$7+1,C$7+C$4+1),17))","v":""},null,null,null,{"$f":"IF(C$3<22,\"\",IF(C$7<22,IF(C$4+C$7>=22,\"3rd in group\",\"Group stage\"),\"1/16 final\"))","v":""}]
[{"$f":"IF(C$3<23,\"\",IF(C$7<23,IF(C$4+C$7>=23,C$7+1,C$7+C$4+1),17))","v":""},null,null,null,{"$f":"IF(C$3<23,\"\",IF(C$7<23,IF(C$4+C$7>=23,\"3rd in group\",\"Group stage\"),\"1/16 final\"))","v":""}]
[{"$f":"IF(C$3<24,\"\",IF(C$7<24,IF(C$4+C$7>=24,C$7+1,C$7+C$4+1),17))","v":""},null,null,null,{"$f":"IF(C$3<24,\"\",IF(C$7<24,IF(C$4+C$7>=24,\"3rd in group\",\"Group stage\"),\"1/16 final\"))","v":""}]
[{"$f":"IF(C$3<25,\"\",IF(C$7<25,IF(C$4+C$7>=25,C$7+1,C$7+C$4+1),17))","v":""},null,null,null,{"$f":"IF(C$3<25,\"\",IF(C$7<25,IF(C$4+C$7>=25,\"3rd in group\",\"Group stage\"),\"1/16 final\"))","v":""}]
[{"$f":"IF(C$3<26,\"\",IF(C$7<26,IF(C$4+C$7>=26,C$7+1,C$7+C$4+1),17))","v":""},null,null,null,{"$f":"IF(C$3<26,\"\",IF(C$7<26,IF(C$4+C$7>=26,\"3rd in group\",\"Group stage\"),\"1/16 final\"))","v":""}]
[{"$f":"IF(C$3<27,\"\",IF(C$7<27,IF(C$4+C$7>=27,C$7+1,C$7+C$4+1),17))","v":""},null,null,null,{"$f":"IF(C$3<27,\"\",IF(C$7<27,IF(C$4+C$7>=27,\"3rd in group\",\"Group stage\"),\"1/16 final\"))","v":""}]
[{"$f":"IF(C$3<28,\"\",IF(C$7<28,IF(C$4+C$7>=28,C$7+1,C$7+C$4+1),17))","v":""},null,null,null,{"$f":"IF(C$3<28,\"\",IF(C$7<28,IF(C$4+C$7>=28,\"3rd in group\",\"Group stage\"),\"1/16 final\"))","v":""}]
[{"$f":"IF(C$3<29,\"\",IF(C$7<29,IF(C$4+C$7>=29,C$7+1,C$7+C$4+1),17))","v":""},null,null,null,{"$f":"IF(C$3<29,\"\",IF(C$7<29,IF(C$4+C$7>=29,\"3rd in group\",\"Group stage\"),\"1/16 final\"))","v":""}]
[{"$f":"IF(C$3<30,\"\",IF(C$7<30,IF(C$4+C$7>=30,C$7+1,C$7+C$4+1),17))","v":""},null,null,null,{"$f":"IF(C$3<30,\"\",IF(C$7<30,IF(C$4+C$7>=30,\"3rd in group\",\"Group stage\"),\"1/16 final\"))","v":""}]
[{"$f":"IF(C$3<31,\"\",IF(C$7<31,IF(C$4+C$7>=31,C$7+1,C$7+C$4+1),17))","v":""},null,null,null,{"$f":"IF(C$3<31,\"\",IF(C$7<31,IF(C$4+C$7>=31,\"3rd in group\",\"Group stage\"),\"1/16 final\"))","v":""}]
[{"$f":"IF(C$3<32,\"\",IF(C$7<32,IF(C$4+C$7>=32,C$7+1,C$7+C$4+1),17))","v":""},null,null,null,{"$f":"IF(C$3<32,\"\",IF(C$7<32,IF(C$4+C$7>=32,\"3rd in group\",\"Group stage\"),\"1/16 final\"))","v":""}]
[{"$f":"IF(C$3<33,\"\",IF(C$7<33,IF(C$4+C$7>=33,C$7+1,C$7+C$4+1),33))","v":""},null,null,null,{"$f":"IF(C$3<33,\"\",IF(C$7<33,IF(C$4+C$7>=33,\"3rd in group\",\"Group stage\"),\"1/32 final\"))","v":""}]
[{"$f":"IF(C$3<34,\"\",IF(C$7<34,IF(C$4+C$7>=34,C$7+1,C$7+C$4+1),33))","v":""},null,null,null,{"$f":"IF(C$3<34,\"\",IF(C$7<34,IF(C$4+C$7>=34,\"3rd in group\",\"Group stage\"),\"1/32 final\"))","v":""}]
[{"$f":"IF(C$3<35,\"\",IF(C$7<35,IF(C$4+C$7>=35,C$7+1,C$7+C$4+1),33))","v":""},null,null,null,{"$f":"IF(C$3<35,\"\",IF(C$7<35,IF(C$4+C$7>=35,\"3rd in group\",\"Group stage\"),\"1/32 final\"))","v":""}]
[{"$f":"IF(C$3<36,\"\",IF(C$7<36,IF(C$4+C$7>=36,C$7+1,C$7+C$4+1),33))","v":""},null,null,null,{"$f":"IF(C$3<36,\"\",IF(C$7<36,IF(C$4+C$7>=36,\"3rd in group\",\"Group stage\"),\"1/32 final\"))","v":""}]
[{"$f":"IF(C$3<37,\"\",IF(C$7<37,IF(C$4+C$7>=37,C$7+1,C$7+C$4+1),33))","v":""},null,null,null,{"$f":"IF(C$3<37,\"\",IF(C$7<37,IF(C$4+C$7>=37,\"3rd in group\",\"Group stage\"),\"1/32 final\"))","v":""}]
[{"$f":"IF(C$3<38,\"\",IF(C$7<38,IF(C$4+C$7>=38,C$7+1,C$7+C$4+1),33))","v":""},null,null,null,{"$f":"IF(C$3<38,\"\",IF(C$7<38,IF(C$4+C$7>=38,\"3rd in group\",\"Group stage\"),\"1/32 final\"))","v":""}]
[{"$f":"IF(C$3<39,\"\",IF(C$7<39,IF(C$4+C$7>=39,C$7+1,C$7+C$4+1),33))","v":""},null,null,null,{"$f":"IF(C$3<39,\"\",IF(C$7<39,IF(C$4+C$7>=39,\"3rd in group\",\"Group stage\"),\"1/32 final\"))","v":""}]
[{"$f":"IF(C$3<40,\"\",IF(C$7<40,IF(C$4+C$7>=40,C$7+1,C$7+C$4+1),33))","v":""},null,null,null,{"$f":"IF(C$3<40,\"\",IF(C$7<40,IF(C$4+C$7>=40,\"3rd in group\",\"Group stage\"),\"1/32 final\"))","v":""}]
[{"$f":"IF(C$3<41,\"\",IF(C$7<41,IF(C$4+C$7>=41,C$7+1,C$7+C$4+1),33))","v":""},null,null,null,{"$f":"IF(C$3<41,\"\",IF(C$7<41,IF(C$4+C$7>=41,\"3rd in group\",\"Group stage\"),\"1/32 final\"))","v":""}]
[{"$f":"IF(C$3<42,\"\",IF(C$7<42,IF(C$4+C$7>=42,C$7+1,C$7+C$4+1),33))","v":""},null,null,null,{"$f":"IF(C$3<42,\"\",IF(C$7<42,IF(C$4+C$7>=42,\"3rd in group\",\"Group stage\"),\"1/32 final\"))","v":""}]
[{"$f":"IF(C$3<43,\"\",IF(C$7<43,IF(C$4+C$7>=43,C$7+1,C$7+C$4+1),33))","v":""},null,null,null,{"$f":"IF(C$3<43,\"\",IF(C$7<43,IF(C$4+C$7>=43,\"3rd in group\",\"Group stage\"),\"1/32 final\"))","v":""}]
[{"$f":"IF(C$3<44,\"\",IF(C$7<44,IF(C$4+C$7>=44,C$7+1,C$7+C$4+1),33))","v":""},null,null,null,{"$f":"IF(C$3<44,\"\",IF(C$7<44,IF(C$4+C$7>=44,\"3rd in group\",\"Group stage\"),\"1/32 final\"))","v":""}]
[{"$f":"IF(C$3<45,\"\",IF(C$7<45,IF(C$4+C$7>=45,C$7+1,C$7+C$4+1),33))","v":""},null,null,null,{"$f":"IF(C$3<45,\"\",IF(C$7<45,IF(C$4+C$7>=45,\"3rd in group\",\"Group stage\"),\"1/32 final\"))","v":""}]
[{"$f":"IF(C$3<46,\"\",IF(C$7<46,IF(C$4+C$7>=46,C$7+1,C$7+C$4+1),33))","v":""},null,null,null,{"$f":"IF(C$3<46,\"\",IF(C$7<46,IF(C$4+C$7>=46,\"3rd in group\",\"Group stage\"),\"1/32 final\"))","v":""}]
[{"$f":"IF(C$3<47,\"\",IF(C$7<47,IF(C$4+C$7>=47,C$7+1,C$7+C$4+1),33))","v":""},null,null,null,{"$f":"IF(C$3<47,\"\",IF(C$7<47,IF(C$4+C$7>=47,\"3rd in group\",\"Group stage\"),\"1/32 final\"))","v":""}]
[{"$f":"IF(C$3<48,\"\",IF(C$7<48,IF(C$4+C$7>=48,C$7+1,C$7+C$4+1),33))","v":""},null,null,null,{"$f":"IF(C$3<48,\"\",IF(C$7<48,IF(C$4+C$7>=48,\"3rd in group\",\"Group stage\"),\"1/32 final\"))","v":""}]
[{"$f":"IF(C$3<49,\"\",IF(C$7<49,IF(C$4+C$7>=49,C$7+1,C$7+C$4+1),33))","v":""},null,null,null,{"$f":"IF(C$3<49,\"\",IF(C$7<49,IF(C$4+C$7>=49,\"3rd in group\",\"Group stage\"),\"1/32 final\"))","v":""}]
[{"$f":"IF(C$3<50,\"\",IF(C$7<50,IF(C$4+C$7>=50,C$7+1,C$7+C$4+1),33))","v":""},null,null,null,{"$f":"IF(C$3<50,\"\",IF(C$7<50,IF(C$4+C$7>=50,\"3rd in group\",\"Group stage\"),\"1/32 final\"))","v":""}]
[{"$f":"IF(C$3<51,\"\",IF(C$7<51,IF(C$4+C$7>=51,C$7+1,C$7+C$4+1),33))","v":""},null,null,null,{"$f":"IF(C$3<51,\"\",IF(C$7<51,IF(C$4+C$7>=51,\"3rd in group\",\"Group stage\"),\"1/32 final\"))","v":""}]
[{"$f":"IF(C$3<52,\"\",IF(C$7<52,IF(C$4+C$7>=52,C$7+1,C$7+C$4+1),33))","v":""},null,null,null,{"$f":"IF(C$3<52,\"\",IF(C$7<52,IF(C$4+C$7>=52,\"3rd in group\",\"Group stage\"),\"1/32 final\"))","v":""}]
[{"$f":"IF(C$3<53,\"\",IF(C$7<53,IF(C$4+C$7>=53,C$7+1,C$7+C$4+1),33))","v":""},null,null,null,{"$f":"IF(C$3<53,\"\",IF(C$7<53,IF(C$4+C$7>=53,\"3rd in group\",\"Group stage\"),\"1/32 final\"))","v":""}]
[{"$f":"IF(C$3<54,\"\",IF(C$7<54,IF(C$4+C$7>=54,C$7+1,C$7+C$4+1),33))","v":""},null,null,null,{"$f":"IF(C$3<54,\"\",IF(C$7<54,IF(C$4+C$7>=54,\"3rd in group\",\"Group stage\"),\"1/32 final\"))","v":""}]
[{"$f":"IF(C$3<55,\"\",IF(C$7<55,IF(C$4+C$7>=55,C$7+1,C$7+C$4+1),33))","v":""},null,null,null,{"$f":"IF(C$3<55,\"\",IF(C$7<55,IF(C$4+C$7>=55,\"3rd in group\",\"Group stage\"),\"1/32 final\"))","v":""}]
[{"$f":"IF(C$3<56,\"\",IF(C$7<56,IF(C$4+C$7>=56,C$7+1,C$7+C$4+1),33))","v":""},null,null,null,{"$f":"IF(C$3<56,\"\",IF(C$7<56,IF(C$4+C$7>=56,\"3rd in group\",\"Group stage\"),\"1/32 final\"))","v":""}]
[{"$f":"IF(C$3<57,\"\",IF(C$7<57,IF(C$4+C$7>=57,C$7+1,C$7+C$4+1),33))","v":""},null,null,null,{"$f":"IF(C$3<57,\"\",IF(C$7<57,IF(C$4+C$7>=57,\"3rd in group\",\"Group stage\"),\"1/32 final\"))","v":""}]
[{"$f":"IF(C$3<58,\"\",IF(C$7<58,IF(C$4+C$7>=58,C$7+1,C$7+C$4+1),33))","v":""},null,null,null,{"$f":"IF(C$3<58,\"\",IF(C$7<58,IF(C$4+C$7>=58,\"3rd in group\",\"Group stage\"),\"1/32 final\"))","v":""}]
[{"$f":"IF(C$3<59,\"\",IF(C$7<59,IF(C$4+C$7>=59,C$7+1,C$7+C$4+1),33))","v":""},null,null,null,{"$f":"IF(C$3<59,\"\",IF(C$7<59,IF(C$4+C$7>=59,\"3rd in group\",\"Group stage\"),\"1/32 final\"))","v":""}]
[{"$f":"IF(C$3<60,\"\",IF(C$7<60,IF(C$4+C$7>=60,C$7+1,C$7+C$4+1),33))","v":""},null,null,null,{"$f":"IF(C$3<60,\"\",IF(C$7<60,IF(C$4+C$7>=60,\"3rd in group\",\"Group stage\"),\"1/32 final\"))","v":""}]
[{"$f":"IF(C$3<61,\"\",IF(C$7<61,IF(C$4+C$7>=61,C$7+1,C$7+C$4+1),33))","v":""},null,null,null,{"$f":"IF(C$3<61,\"\",IF(C$7<61,IF(C$4+C$7>=61,\"3rd in group\",\"Group stage\"),\"1/32 final\"))","v":""}]
[{"$f":"IF(C$3<62,\"\",IF(C$7<62,IF(C$4+C$7>=62,C$7+1,C$7+C$4+1),33))","v":""},null,null,null,{"$f":"IF(C$3<62,\"\",IF(C$7<62,IF(C$4+C$7>=62,\"3rd in group\",\"Group stage\"),\"1/32 final\"))","v":""}]
[{"$f":"IF(C$3<63,\"\",IF(C$7<63,IF(C$4+C$7>=63,C$7+1,C$7+C$4+1),33))","v":""},null,null,null,{"$f":"IF(C$3<63,\"\",IF(C$7<63,IF(C$4+C$7>=63,\"3rd in group\",\"Group stage\"),\"1/32 final\"))","v":""}]
[{"$f":"IF(C$3<64,\"\",IF(C$7<64,IF(C$4+C$7>=64,C$7+1,C$7+C$4+1),33))","v":""},null,null,null,{"$f":"IF(C$3<64,\"\",IF(C$7<64,IF(C$4+C$7>=64,\"3rd in group\",\"Group stage\"),\"1/32 final\"))","v":""}]

{"sheet":"Female U14","index":9,"n_rows":73,"n_cols":5,"rows_kept":73,"cut":false,"hidden":false,"merged":[[0,0,0,4]]}
["Female singles: Juniors U14"]
[]
[null,"Number of players:",16]
[null,"Number of groups :",{"$f":"IF(C3<6,1,IF(C3<11,2,IF(C3=11,3,INT(C3/4))))","v":4}]
[null,"Tournament scheme:",{"$f":"CONCATENATE(IF(C3<6,CONCATENATE(\"1*\",C3),\"\"),IF(C3=6,\"2*3\",\"\"),IF(C3=7,\"1*4 + 1*3\",\"\"),IF(C3=11,\"2*4 + 1*3\",\"\"),IF(OR(C3=15,C3=10),CONCATENATE(C3/5,\"*5\"),\"\"),IF(OR(C3<=7,C3=10,C3=11,C3=15),\"\",CONCATENATE(INT(C3/4)-MOD(C3,4),\"*4\",IF(MOD(C3,4)=0,\"\",CONCATENATE(\" + \",MOD(C3,4),\"*5\")))))","v":"4*4"}]
[null,"Qualification:",{"$f":"IF(C3>=6,\"2 players per group\",\"NA\")","v":"2 players per group"}]
[null,"Nb of qualified players :",{"$f":"IF(C3<6,\"NA\",IF(C3<11,4,IF(C3=11,6,INT(C3/4)*2)))","v":8}]
[]
["Rank","Family name","First-name","Country","Reached stage"]
[1,null,null,null,{"$f":"IF(C$3<6,\"Group stage\",\"Final\")","v":"Final"}]
[2,null,null,null,"Final"]
[3,null,null,null,{"$f":"IF(C$3<6,\"Group stage\",\"1/2 final\")","v":"1/2 final"}]
[{"$f":"IF(C$3<6,4,3)","v":3},null,null,null,"1/2 final"]
[{"$f":"IF(C$3<5,\"\",5)","v":5},null,null,null,{"$f":"IF(C$3<5,\"\",IF(C$3=5,\"Group stage\",IF(C$7<5,\"3rd in group\",\"1/4 final\")))","v":"1/4 final"}]
[{"$f":"IF(C$3<6,\"\",5)","v":5},null,null,null,{"$f":"IF(C$3<6,\"\",IF(C$7<6,\"3rd in group\",\"1/4 final\"))","v":"1/4 final"}]
[{"$f":"IF(C$3<7,\"\",IF(C$7<7,IF(C$4+C$7>=7,C$7+1,C$7+C$4+1),5))","v":5},null,null,null,{"$f":"IF(C$3<7,\"\",IF(C$7<7,IF(C$4+C$7>=7,\"3rd in group\",\"Group stage\"),\"1/4 final\"))","v":"1/4 final"}]
[{"$f":"IF(C$3<8,\"\",IF(C$7<8,IF(C$4+C$7>=8,C$7+1,C$7+C$4+1),5))","v":5},null,null,null,{"$f":"IF(C$3<8,\"\",IF(C$7<8,IF(C$4+C$7>=8,\"3rd in group\",\"Group stage\"),\"1/4 final\"))","v":"1/4 final"}]
[{"$f":"IF(C$3<9,\"\",IF(C$7<9,IF(C$4+C$7>=9,C$7+1,C$7+C$4+1),9))","v":9},null,null,null,{"$f":"IF(C$3<9,\"\",IF(C$7<9,IF(C$4+C$7>=9,\"3rd in group\",\"Group stage\"),\"1/8 final\"))","v":"3rd in group"}]
[{"$f":"IF(C$3<10,\"\",IF(C$7<10,IF(C$4+C$7>=10,C$7+1,C$7+C$4+1),9))","v":9},null,null,null,{"$f":"IF(C$3<10,\"\",IF(C$7<10,IF(C$4+C$7>=10,\"3rd in group\",\"Group stage\"),\"1/8 final\"))","v":"3rd in group"}]
[{"$f":"IF(C$3<11,\"\",IF(C$7<11,IF(C$4+C$7>=11,C$7+1,C$7+C$4+1),9))","v":9},null,null,null,{"$f":"IF(C$3<11,\"\",IF(C$7<11,IF(C$4+C$7>=11,\"3rd in group\",\"Group stage\"),\"1/8 final\"))","v":"3rd in group"}]
[{"$f":"IF(C$3<12,\"\",IF(C$7<12,IF(C$4+C$7>=12,C$7+1,C$7+C$4+1),9))","v":9},null,null,null,{"$f":"IF(C$3<12,\"\",IF(C$7<12,IF(C$4+C$7>=12,\"3rd in group\",\"Group stage\"),\"1/8 final\"))","v":"3rd in group"}]
[{"$f":"IF(C$3<13,\"\",IF(C$7<13,IF(C$4+C$7>=13,C$7+1,C$7+C$4+1),9))","v":13},null,null,null,{"$f":"IF(C$3<13,\"\",IF(C$7<13,IF(C$4+C$7>=13,\"3rd in group\",\"Group stage\"),\"1/8 final\"))","v":"Group stage"}]
[{"$f":"IF(C$3<14,\"\",IF(C$7<14,IF(C$4+C$7>=14,C$7+1,C$7+C$4+1),9))","v":13},null,null,null,{"$f":"IF(C$3<14,\"\",IF(C$7<14,IF(C$4+C$7>=14,\"3rd in group\",\"Group stage\"),\"1/8 final\"))","v":"Group stage"}]
[{"$f":"IF(C$3<15,\"\",IF(C$7<15,IF(C$4+C$7>=15,C$7+1,C$7+C$4+1),9))","v":13},null,null,null,{"$f":"IF(C$3<15,\"\",IF(C$7<15,IF(C$4+C$7>=15,\"3rd in group\",\"Group stage\"),\"1/8 final\"))","v":"Group stage"}]
[{"$f":"IF(C$3<16,\"\",IF(C$7<16,IF(C$4+C$7>=16,C$7+1,C$7+C$4+1),9))","v":13},null,null,null,{"$f":"IF(C$3<16,\"\",IF(C$7<16,IF(C$4+C$7>=16,\"3rd in group\",\"Group stage\"),\"1/8 final\"))","v":"Group stage"}]
[{"$f":"IF(C$3<17,\"\",IF(C$7<17,IF(C$4+C$7>=17,C$7+1,C$7+C$4+1),17))","v":""},null,null,null,{"$f":"IF(C$3<17,\"\",IF(C$7<17,IF(C$4+C$7>=17,\"3rd in group\",\"Group stage\"),\"1/16 final\"))","v":""}]
[{"$f":"IF(C$3<18,\"\",IF(C$7<18,IF(C$4+C$7>=18,C$7+1,C$7+C$4+1),17))","v":""},null,null,null,{"$f":"IF(C$3<18,\"\",IF(C$7<18,IF(C$4+C$7>=18,\"3rd in group\",\"Group stage\"),\"1/16 final\"))","v":""}]
[{"$f":"IF(C$3<19,\"\",IF(C$7<19,IF(C$4+C$7>=19,C$7+1,C$7+C$4+1),17))","v":""},null,null,null,{"$f":"IF(C$3<19,\"\",IF(C$7<19,IF(C$4+C$7>=19,\"3rd in group\",\"Group stage\"),\"1/16 final\"))","v":""}]
[{"$f":"IF(C$3<20,\"\",IF(C$7<20,IF(C$4+C$7>=20,C$7+1,C$7+C$4+1),17))","v":""},null,null,null,{"$f":"IF(C$3<20,\"\",IF(C$7<20,IF(C$4+C$7>=20,\"3rd in group\",\"Group stage\"),\"1/16 final\"))","v":""}]
[{"$f":"IF(C$3<21,\"\",IF(C$7<21,IF(C$4+C$7>=21,C$7+1,C$7+C$4+1),17))","v":""},null,null,null,{"$f":"IF(C$3<21,\"\",IF(C$7<21,IF(C$4+C$7>=21,\"3rd in group\",\"Group stage\"),\"1/16 final\"))","v":""}]
[{"$f":"IF(C$3<22,\"\",IF(C$7<22,IF(C$4+C$7>=22,C$7+1,C$7+C$4+1),17))","v":""},null,null,null,{"$f":"IF(C$3<22,\"\",IF(C$7<22,IF(C$4+C$7>=22,\"3rd in group\",\"Group stage\"),\"1/16 final\"))","v":""}]
[{"$f":"IF(C$3<23,\"\",IF(C$7<23,IF(C$4+C$7>=23,C$7+1,C$7+C$4+1),17))","v":""},null,null,null,{"$f":"IF(C$3<23,\"\",IF(C$7<23,IF(C$4+C$7>=23,\"3rd in group\",\"Group stage\"),\"1/16 final\"))","v":""}]
[{"$f":"IF(C$3<24,\"\",IF(C$7<24,IF(C$4+C$7>=24,C$7+1,C$7+C$4+1),17))","v":""},null,null,null,{"$f":"IF(C$3<24,\"\",IF(C$7<24,IF(C$4+C$7>=24,\"3rd in group\",\"Group stage\"),\"1/16 final\"))","v":""}]
[{"$f":"IF(C$3<25,\"\",IF(C$7<25,IF(C$4+C$7>=25,C$7+1,C$7+C$4+1),17))","v":""},null,null,null,{"$f":"IF(C$3<25,\"\",IF(C$7<25,IF(C$4+C$7>=25,\"3rd in group\",\"Group stage\"),\"1/16 final\"))","v":""}]
[{"$f":"IF(C$3<26,\"\",IF(C$7<26,IF(C$4+C$7>=26,C$7+1,C$7+C$4+1),17))","v":""},null,null,null,{"$f":"IF(C$3<26,\"\",IF(C$7<26,IF(C$4+C$7>=26,\"3rd in group\",\"Group stage\"),\"1/16 final\"))","v":""}]
[{"$f":"IF(C$3<27,\"\",IF(C$7<27,IF(C$4+C$7>=27,C$7+1,C$7+C$4+1),17))","v":""},null,null,null,{"$f":"IF(C$3<27,\"\",IF(C$7<27,IF(C$4+C$7>=27,\"3rd in group\",\"Group stage\"),\"1/16 final\"))","v":""}]
[{"$f":"IF(C$3<28,\"\",IF(C$7<28,IF(C$4+C$7>=28,C$7+1,C$7+C$4+1),17))","v":""},null,null,null,{"$f":"IF(C$3<28,\"\",IF(C$7<28,IF(C$4+C$7>=28,\"3rd in group\",\"Group stage\"),\"1/16 final\"))","v":""}]
[{"$f":"IF(C$3<29,\"\",IF(C$7<29,IF(C$4+C$7>=29,C$7+1,C$7+C$4+1),17))","v":""},null,null,null,{"$f":"IF(C$3<29,\"\",IF(C$7<29,IF(C$4+C$7>=29,\"3rd in group\",\"Group stage\"),\"1/16 final\"))","v":""}]
[{"$f":"IF(C$3<30,\"\",IF(C$7<30,IF(C$4+C$7>=30,C$7+1,C$7+C$4+1),17))","v":""},null,null,null,{"$f":"IF(C$3<30,\"\",IF(C$7<30,IF(C$4+C$7>=30,\"3rd in group\",\"Group stage\"),\"1/16 final\"))","v":""}]
[{"$f":"IF(C$3<31,\"\",IF(C$7<31,IF(C$4+C$7>=31,C$7+1,C$7+C$4+1),17))","v":""},null,null,null,{"$f":"IF(C$3<31,\"\",IF(C$7<31,IF(C$4+C$7>=31,\"3rd in group\",\"Group stage\"),\"1/16 final\"))","v":""}]
[{"$f":"IF(C$3<32,\"\",IF(C$7<32,IF(C$4+C$7>=32,C$7+1,C$7+C$4+1),17))","v":""},null,null,null,{"$f":"IF(C$3<32,\"\",IF(C$7<32,IF(C$4+C$7>=32,\"3rd in group\",\"Group stage\"),\"1/16 final\"))","v":""}]
[{"$f":"IF(C$3<33,\"\",IF(C$7<33,IF(C$4+C$7>=33,C$7+1,C$7+C$4+1),33))","v":""},null,null,null,{"$f":"IF(C$3<33,\"\",IF(C$7<33,IF(C$4+C$7>=33,\"3rd in group\",\"Group stage\"),\"1/32 final\"))","v":""}]
[{"$f":"IF(C$3<34,\"\",IF(C$7<34,IF(C$4+C$7>=34,C$7+1,C$7+C$4+1),33))","v":""},null,null,null,{"$f":"IF(C$3<34,\"\",IF(C$7<34,IF(C$4+C$7>=34,\"3rd in group\",\"Group stage\"),\"1/32 final\"))","v":""}]
[{"$f":"IF(C$3<35,\"\",IF(C$7<35,IF(C$4+C$7>=35,C$7+1,C$7+C$4+1),33))","v":""},null,null,null,{"$f":"IF(C$3<35,\"\",IF(C$7<35,IF(C$4+C$7>=35,\"3rd in group\",\"Group stage\"),\"1/32 final\"))","v":""}]
[{"$f":"IF(C$3<36,\"\",IF(C$7<36,IF(C$4+C$7>=36,C$7+1,C$7+C$4+1),33))","v":""},null,null,null,{"$f":"IF(C$3<36,\"\",IF(C$7<36,IF(C$4+C$7>=36,\"3rd in group\",\"Group stage\"),\"1/32 final\"))","v":""}]
[{"$f":"IF(C$3<37,\"\",IF(C$7<37,IF(C$4+C$7>=37,C$7+1,C$7+C$4+1),33))","v":""},null,null,null,{"$f":"IF(C$3<37,\"\",IF(C$7<37,IF(C$4+C$7>=37,\"3rd in group\",\"Group stage\"),\"1/32 final\"))","v":""}]
[{"$f":"IF(C$3<38,\"\",IF(C$7<38,IF(C$4+C$7>=38,C$7+1,C$7+C$4+1),33))","v":""},null,null,null,{"$f":"IF(C$3<38,\"\",IF(C$7<38,IF(C$4+C$7>=38,\"3rd in group\",\"Group stage\"),\"1/32 final\"))","v":""}]
[{"$f":"IF(C$3<39,\"\",IF(C$7<39,IF(C$4+C$7>=39,C$7+1,C$7+C$4+1),33))","v":""},null,null,null,{"$f":"IF(C$3<39,\"\",IF(C$7<39,IF(C$4+C$7>=39,\"3rd in group\",\"Group stage\"),\"1/32 final\"))","v":""}]
[{"$f":"IF(C$3<40,\"\",IF(C$7<40,IF(C$4+C$7>=40,C$7+1,C$7+C$4+1),33))","v":""},null,null,null,{"$f":"IF(C$3<40,\"\",IF(C$7<40,IF(C$4+C$7>=40,\"3rd in group\",\"Group stage\"),\"1/32 final\"))","v":""}]
[{"$f":"IF(C$3<41,\"\",IF(C$7<41,IF(C$4+C$7>=41,C$7+1,C$7+C$4+1),33))","v":""},null,null,null,{"$f":"IF(C$3<41,\"\",IF(C$7<41,IF(C$4+C$7>=41,\"3rd in group\",\"Group stage\"),\"1/32 final\"))","v":""}]
[{"$f":"IF(C$3<42,\"\",IF(C$7<42,IF(C$4+C$7>=42,C$7+1,C$7+C$4+1),33))","v":""},null,null,null,{"$f":"IF(C$3<42,\"\",IF(C$7<42,IF(C$4+C$7>=42,\"3rd in group\",\"Group stage\"),\"1/32 final\"))","v":""}]
[{"$f":"IF(C$3<43,\"\",IF(C$7<43,IF(C$4+C$7>=43,C$7+1,C$7+C$4+1),33))","v":""},null,null,null,{"$f":"IF(C$3<43,\"\",IF(C$7<43,IF(C$4+C$7>=43,\"3rd in group\",\"Group stage\"),\"1/32 final\"))","v":""}]
[{"$f":"IF(C$3<44,\"\",IF(C$7<44,IF(C$4+C$7>=44,C$7+1,C$7+C$4+1),33))","v":""},null,null,null,{"$f":"IF(C$3<44,\"\",IF(C$7<44,IF(C$4+C$7>=44,\"3rd in group\",\"Group stage\"),\"1/32 final\"))","v":""}]
[{"$f":"IF(C$3<45,\"\",IF(C$7<45,IF(C$4+C$7>=45,C$7+1,C$7+C$4+1),33))","v":""},null,null,null,{"$f":"IF(C$3<45,\"\",IF(C$7<45,IF(C$4+C$7>=45,\"3rd in group\",\"Group stage\"),\"1/32 final\"))","v":""}]
[{"$f":"IF(C$3<46,\"\",IF(C$7<46,IF(C$4+C$7>=46,C$7+1,C$7+C$4+1),33))","v":""},null,null,null,{"$f":"IF(C$3<46,\"\",IF(C$7<46,IF(C$4+C$7>=46,\"3rd in group\",\"Group stage\"),\"1/32 final\"))","v":""}]
[{"$f":"IF(C$3<47,\"\",IF(C$7<47,IF(C$4+C$7>=47,C$7+1,C$7+C$4+1),33))","v":""},null,null,null,{"$f":"IF(C$3<47,\"\",IF(C$7<47,IF(C$4+C$7>=47,\"3rd in group\",\"Group stage\"),\"1/32 final\"))","v":""}]
[{"$f":"IF(C$3<48,\"\",IF(C$7<48,IF(C$4+C$7>=48,C$7+1,C$7+C$4+1),33))","v":""},null,null,null,{"$f":"IF(C$3<48,\"\",IF(C$7<48,IF(C$4+C$7>=48,\"3rd in group\",\"Group stage\"),\"1/32 final\"))","v":""}]
[{"$f":"IF(C$3<49,\"\",IF(C$7<49,IF(C$4+C$7>=49,C$7+1,C$7+C$4+1),33))","v":""},null,null,null,{"$f":"IF(C$3<49,\"\",IF(C$7<49,IF(C$4+C$7>=49,\"3rd in group\",\"Group stage\"),\"1/32 final\"))","v":""}]
[{"$f":"IF(C$3<50,\"\",IF(C$7<50,IF(C$4+C$7>=50,C$7+1,C$7+C$4+1),33))","v":""},null,null,null,{"$f":"IF(C$3<50,\"\",IF(C$7<50,IF(C$4+C$7>=50,\"3rd in group\",\"Group stage\"),\"1/32 final\"))","v":""}]
[{"$f":"IF(C$3<51,\"\",IF(C$7<51,IF(C$4+C$7>=51,C$7+1,C$7+C$4+1),33))","v":""},null,null,null,{"$f":"IF(C$3<51,\"\",IF(C$7<51,IF(C$4+C$7>=51,\"3rd in group\",\"Group stage\"),\"1/32 final\"))","v":""}]
[{"$f":"IF(C$3<52,\"\",IF(C$7<52,IF(C$4+C$7>=52,C$7+1,C$7+C$4+1),33))","v":""},null,null,null,{"$f":"IF(C$3<52,\"\",IF(C$7<52,IF(C$4+C$7>=52,\"3rd in group\",\"Group stage\"),\"1/32 final\"))","v":""}]
[{"$f":"IF(C$3<53,\"\",IF(C$7<53,IF(C$4+C$7>=53,C$7+1,C$7+C$4+1),33))","v":""},null,null,null,{"$f":"IF(C$3<53,\"\",IF(C$7<53,IF(C$4+C$7>=53,\"3rd in group\",\"Group stage\"),\"1/32 final\"))","v":""}]
[{"$f":"IF(C$3<54,\"\",IF(C$7<54,IF(C$4+C$7>=54,C$7+1,C$7+C$4+1),33))","v":""},null,null,null,{"$f":"IF(C$3<54,\"\",IF(C$7<54,IF(C$4+C$7>=54,\"3rd in group\",\"Group stage\"),\"1/32 final\"))","v":""}]
[{"$f":"IF(C$3<55,\"\",IF(C$7<55,IF(C$4+C$7>=55,C$7+1,C$7+C$4+1),33))","v":""},null,null,null,{"$f":"IF(C$3<55,\"\",IF(C$7<55,IF(C$4+C$7>=55,\"3rd in group\",\"Group stage\"),\"1/32 final\"))","v":""}]
[{"$f":"IF(C$3<56,\"\",IF(C$7<56,IF(C$4+C$7>=56,C$7+1,C$7+C$4+1),33))","v":""},null,null,null,{"$f":"IF(C$3<56,\"\",IF(C$7<56,IF(C$4+C$7>=56,\"3rd in group\",\"Group stage\"),\"1/32 final\"))","v":""}]
[{"$f":"IF(C$3<57,\"\",IF(C$7<57,IF(C$4+C$7>=57,C$7+1,C$7+C$4+1),33))","v":""},null,null,null,{"$f":"IF(C$3<57,\"\",IF(C$7<57,IF(C$4+C$7>=57,\"3rd in group\",\"Group stage\"),\"1/32 final\"))","v":""}]
[{"$f":"IF(C$3<58,\"\",IF(C$7<58,IF(C$4+C$7>=58,C$7+1,C$7+C$4+1),33))","v":""},null,null,null,{"$f":"IF(C$3<58,\"\",IF(C$7<58,IF(C$4+C$7>=58,\"3rd in group\",\"Group stage\"),\"1/32 final\"))","v":""}]
[{"$f":"IF(C$3<59,\"\",IF(C$7<59,IF(C$4+C$7>=59,C$7+1,C$7+C$4+1),33))","v":""},null,null,null,{"$f":"IF(C$3<59,\"\",IF(C$7<59,IF(C$4+C$7>=59,\"3rd in group\",\"Group stage\"),\"1/32 final\"))","v":""}]
[{"$f":"IF(C$3<60,\"\",IF(C$7<60,IF(C$4+C$7>=60,C$7+1,C$7+C$4+1),33))","v":""},null,null,null,{"$f":"IF(C$3<60,\"\",IF(C$7<60,IF(C$4+C$7>=60,\"3rd in group\",\"Group stage\"),\"1/32 final\"))","v":""}]
[{"$f":"IF(C$3<61,\"\",IF(C$7<61,IF(C$4+C$7>=61,C$7+1,C$7+C$4+1),33))","v":""},null,null,null,{"$f":"IF(C$3<61,\"\",IF(C$7<61,IF(C$4+C$7>=61,\"3rd in group\",\"Group stage\"),\"1/32 final\"))","v":""}]
[{"$f":"IF(C$3<62,\"\",IF(C$7<62,IF(C$4+C$7>=62,C$7+1,C$7+C$4+1),33))","v":""},null,null,null,{"$f":"IF(C$3<62,\"\",IF(C$7<62,IF(C$4+C$7>=62,\"3rd in group\",\"Group stage\"),\"1/32 final\"))","v":""}]
[{"$f":"IF(C$3<63,\"\",IF(C$7<63,IF(C$4+C$7>=63,C$7+1,C$7+C$4+1),33))","v":""},null,null,null,{"$f":"IF(C$3<63,\"\",IF(C$7<63,IF(C$4+C$7>=63,\"3rd in group\",\"Group stage\"),\"1/32 final\"))","v":""}]
[{"$f":"IF(C$3<64,\"\",IF(C$7<64,IF(C$4+C$7>=64,C$7+1,C$7+C$4+1),33))","v":""},null,null,null,{"$f":"IF(C$3<64,\"\",IF(C$7<64,IF(C$4+C$7>=64,\"3rd in group\",\"Group stage\"),\"1/32 final\"))","v":""}]

{"sheet":"Male U14","index":10,"n_rows":73,"n_cols":5,"rows_kept":73,"cut":false,"hidden":false,"merged":[[0,0,0,4]]}
["Male singles: Juniors U14"]
[]
[null,"Number of players:",16]
[null,"Number of groups :",{"$f":"IF(C3<6,1,IF(C3<11,2,IF(C3=11,3,INT(C3/4))))","v":4}]
[null,"Tournament scheme:",{"$f":"CONCATENATE(IF(C3<6,CONCATENATE(\"1*\",C3),\"\"),IF(C3=6,\"2*3\",\"\"),IF(C3=7,\"1*4 + 1*3\",\"\"),IF(C3=11,\"2*4 + 1*3\",\"\"),IF(OR(C3=15,C3=10),CONCATENATE(C3/5,\"*5\"),\"\"),IF(OR(C3<=7,C3=10,C3=11,C3=15),\"\",CONCATENATE(INT(C3/4)-MOD(C3,4),\"*4\",IF(MOD(C3,4)=0,\"\",CONCATENATE(\" + \",MOD(C3,4),\"*5\")))))","v":"4*4"}]
[null,"Qualification:",{"$f":"IF(C3>=6,\"2 players per group\",\"NA\")","v":"2 players per group"}]
[null,"Nb of qualified players :",{"$f":"IF(C3<6,\"NA\",IF(C3<11,4,IF(C3=11,6,INT(C3/4)*2)))","v":8}]
[]
["Rank","Family name","First-name","Country","Reached stage"]
[1,null,null,null,{"$f":"IF(C$3<6,\"Group stage\",\"Final\")","v":"Final"}]
[2,null,null,null,"Final"]
[3,null,null,null,{"$f":"IF(C$3<6,\"Group stage\",\"1/2 final\")","v":"1/2 final"}]
[{"$f":"IF(C$3<6,4,3)","v":3},null,null,null,"1/2 final"]
[{"$f":"IF(C$3<5,\"\",5)","v":5},null,null,null,{"$f":"IF(C$3<5,\"\",IF(C$3=5,\"Group stage\",IF(C$7<5,\"3rd in group\",\"1/4 final\")))","v":"1/4 final"}]
[{"$f":"IF(C$3<6,\"\",5)","v":5},null,null,null,{"$f":"IF(C$3<6,\"\",IF(C$7<6,\"3rd in group\",\"1/4 final\"))","v":"1/4 final"}]
[{"$f":"IF(C$3<7,\"\",IF(C$7<7,IF(C$4+C$7>=7,C$7+1,C$7+C$4+1),5))","v":5},null,null,null,{"$f":"IF(C$3<7,\"\",IF(C$7<7,IF(C$4+C$7>=7,\"3rd in group\",\"Group stage\"),\"1/4 final\"))","v":"1/4 final"}]
[{"$f":"IF(C$3<8,\"\",IF(C$7<8,IF(C$4+C$7>=8,C$7+1,C$7+C$4+1),5))","v":5},null,null,null,{"$f":"IF(C$3<8,\"\",IF(C$7<8,IF(C$4+C$7>=8,\"3rd in group\",\"Group stage\"),\"1/4 final\"))","v":"1/4 final"}]
[{"$f":"IF(C$3<9,\"\",IF(C$7<9,IF(C$4+C$7>=9,C$7+1,C$7+C$4+1),9))","v":9},null,null,null,{"$f":"IF(C$3<9,\"\",IF(C$7<9,IF(C$4+C$7>=9,\"3rd in group\",\"Group stage\"),\"1/8 final\"))","v":"3rd in group"}]
[{"$f":"IF(C$3<10,\"\",IF(C$7<10,IF(C$4+C$7>=10,C$7+1,C$7+C$4+1),9))","v":9},null,null,null,{"$f":"IF(C$3<10,\"\",IF(C$7<10,IF(C$4+C$7>=10,\"3rd in group\",\"Group stage\"),\"1/8 final\"))","v":"3rd in group"}]
[{"$f":"IF(C$3<11,\"\",IF(C$7<11,IF(C$4+C$7>=11,C$7+1,C$7+C$4+1),9))","v":9},null,null,null,{"$f":"IF(C$3<11,\"\",IF(C$7<11,IF(C$4+C$7>=11,\"3rd in group\",\"Group stage\"),\"1/8 final\"))","v":"3rd in group"}]
[{"$f":"IF(C$3<12,\"\",IF(C$7<12,IF(C$4+C$7>=12,C$7+1,C$7+C$4+1),9))","v":9},null,null,null,{"$f":"IF(C$3<12,\"\",IF(C$7<12,IF(C$4+C$7>=12,\"3rd in group\",\"Group stage\"),\"1/8 final\"))","v":"3rd in group"}]
[{"$f":"IF(C$3<13,\"\",IF(C$7<13,IF(C$4+C$7>=13,C$7+1,C$7+C$4+1),9))","v":13},null,null,null,{"$f":"IF(C$3<13,\"\",IF(C$7<13,IF(C$4+C$7>=13,\"3rd in group\",\"Group stage\"),\"1/8 final\"))","v":"Group stage"}]
[{"$f":"IF(C$3<14,\"\",IF(C$7<14,IF(C$4+C$7>=14,C$7+1,C$7+C$4+1),9))","v":13},null,null,null,{"$f":"IF(C$3<14,\"\",IF(C$7<14,IF(C$4+C$7>=14,\"3rd in group\",\"Group stage\"),\"1/8 final\"))","v":"Group stage"}]
[{"$f":"IF(C$3<15,\"\",IF(C$7<15,IF(C$4+C$7>=15,C$7+1,C$7+C$4+1),9))","v":13},null,null,null,{"$f":"IF(C$3<15,\"\",IF(C$7<15,IF(C$4+C$7>=15,\"3rd in group\",\"Group stage\"),\"1/8 final\"))","v":"Group stage"}]
[{"$f":"IF(C$3<16,\"\",IF(C$7<16,IF(C$4+C$7>=16,C$7+1,C$7+C$4+1),9))","v":13},null,null,null,{"$f":"IF(C$3<16,\"\",IF(C$7<16,IF(C$4+C$7>=16,\"3rd in group\",\"Group stage\"),\"1/8 final\"))","v":"Group stage"}]
[{"$f":"IF(C$3<17,\"\",IF(C$7<17,IF(C$4+C$7>=17,C$7+1,C$7+C$4+1),17))","v":""},null,null,null,{"$f":"IF(C$3<17,\"\",IF(C$7<17,IF(C$4+C$7>=17,\"3rd in group\",\"Group stage\"),\"1/16 final\"))","v":""}]
[{"$f":"IF(C$3<18,\"\",IF(C$7<18,IF(C$4+C$7>=18,C$7+1,C$7+C$4+1),17))","v":""},null,null,null,{"$f":"IF(C$3<18,\"\",IF(C$7<18,IF(C$4+C$7>=18,\"3rd in group\",\"Group stage\"),\"1/16 final\"))","v":""}]
[{"$f":"IF(C$3<19,\"\",IF(C$7<19,IF(C$4+C$7>=19,C$7+1,C$7+C$4+1),17))","v":""},null,null,null,{"$f":"IF(C$3<19,\"\",IF(C$7<19,IF(C$4+C$7>=19,\"3rd in group\",\"Group stage\"),\"1/16 final\"))","v":""}]
[{"$f":"IF(C$3<20,\"\",IF(C$7<20,IF(C$4+C$7>=20,C$7+1,C$7+C$4+1),17))","v":""},null,null,null,{"$f":"IF(C$3<20,\"\",IF(C$7<20,IF(C$4+C$7>=20,\"3rd in group\",\"Group stage\"),\"1/16 final\"))","v":""}]
[{"$f":"IF(C$3<21,\"\",IF(C$7<21,IF(C$4+C$7>=21,C$7+1,C$7+C$4+1),17))","v":""},null,null,null,{"$f":"IF(C$3<21,\"\",IF(C$7<21,IF(C$4+C$7>=21,\"3rd in group\",\"Group stage\"),\"1/16 final\"))","v":""}]
[{"$f":"IF(C$3<22,\"\",IF(C$7<22,IF(C$4+C$7>=22,C$7+1,C$7+C$4+1),17))","v":""},null,null,null,{"$f":"IF(C$3<22,\"\",IF(C$7<22,IF(C$4+C$7>=22,\"3rd in group\",\"Group stage\"),\"1/16 final\"))","v":""}]
[{"$f":"IF(C$3<23,\"\",IF(C$7<23,IF(C$4+C$7>=23,C$7+1,C$7+C$4+1),17))","v":""},null,null,null,{"$f":"IF(C$3<23,\"\",IF(C$7<23,IF(C$4+C$7>=23,\"3rd in group\",\"Group stage\"),\"1/16 final\"))","v":""}]
[{"$f":"IF(C$3<24,\"\",IF(C$7<24,IF(C$4+C$7>=24,C$7+1,C$7+C$4+1),17))","v":""},null,null,null,{"$f":"IF(C$3<24,\"\",IF(C$7<24,IF(C$4+C$7>=24,\"3rd in group\",\"Group stage\"),\"1/16 final\"))","v":""}]
[{"$f":"IF(C$3<25,\"\",IF(C$7<25,IF(C$4+C$7>=25,C$7+1,C$7+C$4+1),17))","v":""},null,null,null,{"$f":"IF(C$3<25,\"\",IF(C$7<25,IF(C$4+C$7>=25,\"3rd in group\",\"Group stage\"),\"1/16 final\"))","v":""}]
[{"$f":"IF(C$3<26,\"\",IF(C$7<26,IF(C$4+C$7>=26,C$7+1,C$7+C$4+1),17))","v":""},null,null,null,{"$f":"IF(C$3<26,\"\",IF(C$7<26,IF(C$4+C$7>=26,\"3rd in group\",\"Group stage\"),\"1/16 final\"))","v":""}]
[{"$f":"IF(C$3<27,\"\",IF(C$7<27,IF(C$4+C$7>=27,C$7+1,C$7+C$4+1),17))","v":""},null,null,null,{"$f":"IF(C$3<27,\"\",IF(C$7<27,IF(C$4+C$7>=27,\"3rd in group\",\"Group stage\"),\"1/16 final\"))","v":""}]
[{"$f":"IF(C$3<28,\"\",IF(C$7<28,IF(C$4+C$7>=28,C$7+1,C$7+C$4+1),17))","v":""},null,null,null,{"$f":"IF(C$3<28,\"\",IF(C$7<28,IF(C$4+C$7>=28,\"3rd in group\",\"Group stage\"),\"1/16 final\"))","v":""}]
[{"$f":"IF(C$3<29,\"\",IF(C$7<29,IF(C$4+C$7>=29,C$7+1,C$7+C$4+1),17))","v":""},null,null,null,{"$f":"IF(C$3<29,\"\",IF(C$7<29,IF(C$4+C$7>=29,\"3rd in group\",\"Group stage\"),\"1/16 final\"))","v":""}]
[{"$f":"IF(C$3<30,\"\",IF(C$7<30,IF(C$4+C$7>=30,C$7+1,C$7+C$4+1),17))","v":""},null,null,null,{"$f":"IF(C$3<30,\"\",IF(C$7<30,IF(C$4+C$7>=30,\"3rd in group\",\"Group stage\"),\"1/16 final\"))","v":""}]
[{"$f":"IF(C$3<31,\"\",IF(C$7<31,IF(C$4+C$7>=31,C$7+1,C$7+C$4+1),17))","v":""},null,null,null,{"$f":"IF(C$3<31,\"\",IF(C$7<31,IF(C$4+C$7>=31,\"3rd in group\",\"Group stage\"),\"1/16 final\"))","v":""}]
[{"$f":"IF(C$3<32,\"\",IF(C$7<32,IF(C$4+C$7>=32,C$7+1,C$7+C$4+1),17))","v":""},null,null,null,{"$f":"IF(C$3<32,\"\",IF(C$7<32,IF(C$4+C$7>=32,\"3rd in group\",\"Group stage\"),\"1/16 final\"))","v":""}]
[{"$f":"IF(C$3<33,\"\",IF(C$7<33,IF(C$4+C$7>=33,C$7+1,C$7+C$4+1),33))","v":""},null,null,null,{"$f":"IF(C$3<33,\"\",IF(C$7<33,IF(C$4+C$7>=33,\"3rd in group\",\"Group stage\"),\"1/32 final\"))","v":""}]
[{"$f":"IF(C$3<34,\"\",IF(C$7<34,IF(C$4+C$7>=34,C$7+1,C$7+C$4+1),33))","v":""},null,null,null,{"$f":"IF(C$3<34,\"\",IF(C$7<34,IF(C$4+C$7>=34,\"3rd in group\",\"Group stage\"),\"1/32 final\"))","v":""}]
[{"$f":"IF(C$3<35,\"\",IF(C$7<35,IF(C$4+C$7>=35,C$7+1,C$7+C$4+1),33))","v":""},null,null,null,{"$f":"IF(C$3<35,\"\",IF(C$7<35,IF(C$4+C$7>=35,\"3rd in group\",\"Group stage\"),\"1/32 final\"))","v":""}]
[{"$f":"IF(C$3<36,\"\",IF(C$7<36,IF(C$4+C$7>=36,C$7+1,C$7+C$4+1),33))","v":""},null,null,null,{"$f":"IF(C$3<36,\"\",IF(C$7<36,IF(C$4+C$7>=36,\"3rd in group\",\"Group stage\"),\"1/32 final\"))","v":""}]
[{"$f":"IF(C$3<37,\"\",IF(C$7<37,IF(C$4+C$7>=37,C$7+1,C$7+C$4+1),33))","v":""},null,null,null,{"$f":"IF(C$3<37,\"\",IF(C$7<37,IF(C$4+C$7>=37,\"3rd in group\",\"Group stage\"),\"1/32 final\"))","v":""}]
[{"$f":"IF(C$3<38,\"\",IF(C$7<38,IF(C$4+C$7>=38,C$7+1,C$7+C$4+1),33))","v":""},null,null,null,{"$f":"IF(C$3<38,\"\",IF(C$7<38,IF(C$4+C$7>=38,\"3rd in group\",\"Group stage\"),\"1/32 final\"))","v":""}]
[{"$f":"IF(C$3<39,\"\",IF(C$7<39,IF(C$4+C$7>=39,C$7+1,C$7+C$4+1),33))","v":""},null,null,null,{"$f":"IF(C$3<39,\"\",IF(C$7<39,IF(C$4+C$7>=39,\"3rd in group\",\"Group stage\"),\"1/32 final\"))","v":""}]
[{"$f":"IF(C$3<40,\"\",IF(C$7<40,IF(C$4+C$7>=40,C$7+1,C$7+C$4+1),33))","v":""},null,null,null,{"$f":"IF(C$3<40,\"\",IF(C$7<40,IF(C$4+C$7>=40,\"3rd in group\",\"Group stage\"),\"1/32 final\"))","v":""}]
[{"$f":"IF(C$3<41,\"\",IF(C$7<41,IF(C$4+C$7>=41,C$7+1,C$7+C$4+1),33))","v":""},null,null,null,{"$f":"IF(C$3<41,\"\",IF(C$7<41,IF(C$4+C$7>=41,\"3rd in group\",\"Group stage\"),\"1/32 final\"))","v":""}]
[{"$f":"IF(C$3<42,\"\",IF(C$7<42,IF(C$4+C$7>=42,C$7+1,C$7+C$4+1),33))","v":""},null,null,null,{"$f":"IF(C$3<42,\"\",IF(C$7<42,IF(C$4+C$7>=42,\"3rd in group\",\"Group stage\"),\"1/32 final\"))","v":""}]
[{"$f":"IF(C$3<43,\"\",IF(C$7<43,IF(C$4+C$7>=43,C$7+1,C$7+C$4+1),33))","v":""},null,null,null,{"$f":"IF(C$3<43,\"\",IF(C$7<43,IF(C$4+C$7>=43,\"3rd in group\",\"Group stage\"),\"1/32 final\"))","v":""}]
[{"$f":"IF(C$3<44,\"\",IF(C$7<44,IF(C$4+C$7>=44,C$7+1,C$7+C$4+1),33))","v":""},null,null,null,{"$f":"IF(C$3<44,\"\",IF(C$7<44,IF(C$4+C$7>=44,\"3rd in group\",\"Group stage\"),\"1/32 final\"))","v":""}]
[{"$f":"IF(C$3<45,\"\",IF(C$7<45,IF(C$4+C$7>=45,C$7+1,C$7+C$4+1),33))","v":""},null,null,null,{"$f":"IF(C$3<45,\"\",IF(C$7<45,IF(C$4+C$7>=45,\"3rd in group\",\"Group stage\"),\"1/32 final\"))","v":""}]
[{"$f":"IF(C$3<46,\"\",IF(C$7<46,IF(C$4+C$7>=46,C$7+1,C$7+C$4+1),33))","v":""},null,null,null,{"$f":"IF(C$3<46,\"\",IF(C$7<46,IF(C$4+C$7>=46,\"3rd in group\",\"Group stage\"),\"1/32 final\"))","v":""}]
[{"$f":"IF(C$3<47,\"\",IF(C$7<47,IF(C$4+C$7>=47,C$7+1,C$7+C$4+1),33))","v":""},null,null,null,{"$f":"IF(C$3<47,\"\",IF(C$7<47,IF(C$4+C$7>=47,\"3rd in group\",\"Group stage\"),\"1/32 final\"))","v":""}]
[{"$f":"IF(C$3<48,\"\",IF(C$7<48,IF(C$4+C$7>=48,C$7+1,C$7+C$4+1),33))","v":""},null,null,null,{"$f":"IF(C$3<48,\"\",IF(C$7<48,IF(C$4+C$7>=48,\"3rd in group\",\"Group stage\"),\"1/32 final\"))","v":""}]
[{"$f":"IF(C$3<49,\"\",IF(C$7<49,IF(C$4+C$7>=49,C$7+1,C$7+C$4+1),33))","v":""},null,null,null,{"$f":"IF(C$3<49,\"\",IF(C$7<49,IF(C$4+C$7>=49,\"3rd in group\",\"Group stage\"),\"1/32 final\"))","v":""}]
[{"$f":"IF(C$3<50,\"\",IF(C$7<50,IF(C$4+C$7>=50,C$7+1,C$7+C$4+1),33))","v":""},null,null,null,{"$f":"IF(C$3<50,\"\",IF(C$7<50,IF(C$4+C$7>=50,\"3rd in group\",\"Group stage\"),\"1/32 final\"))","v":""}]
[{"$f":"IF(C$3<51,\"\",IF(C$7<51,IF(C$4+C$7>=51,C$7+1,C$7+C$4+1),33))","v":""},null,null,null,{"$f":"IF(C$3<51,\"\",IF(C$7<51,IF(C$4+C$7>=51,\"3rd in group\",\"Group stage\"),\"1/32 final\"))","v":""}]
[{"$f":"IF(C$3<52,\"\",IF(C$7<52,IF(C$4+C$7>=52,C$7+1,C$7+C$4+1),33))","v":""},null,null,null,{"$f":"IF(C$3<52,\"\",IF(C$7<52,IF(C$4+C$7>=52,\"3rd in group\",\"Group stage\"),\"1/32 final\"))","v":""}]
[{"$f":"IF(C$3<53,\"\",IF(C$7<53,IF(C$4+C$7>=53,C$7+1,C$7+C$4+1),33))","v":""},null,null,null,{"$f":"IF(C$3<53,\"\",IF(C$7<53,IF(C$4+C$7>=53,\"3rd in group\",\"Group stage\"),\"1/32 final\"))","v":""}]
[{"$f":"IF(C$3<54,\"\",IF(C$7<54,IF(C$4+C$7>=54,C$7+1,C$7+C$4+1),33))","v":""},null,null,null,{"$f":"IF(C$3<54,\"\",IF(C$7<54,IF(C$4+C$7>=54,\"3rd in group\",\"Group stage\"),\"1/32 final\"))","v":""}]
[{"$f":"IF(C$3<55,\"\",IF(C$7<55,IF(C$4+C$7>=55,C$7+1,C$7+C$4+1),33))","v":""},null,null,null,{"$f":"IF(C$3<55,\"\",IF(C$7<55,IF(C$4+C$7>=55,\"3rd in group\",\"Group stage\"),\"1/32 final\"))","v":""}]
[{"$f":"IF(C$3<56,\"\",IF(C$7<56,IF(C$4+C$7>=56,C$7+1,C$7+C$4+1),33))","v":""},null,null,null,{"$f":"IF(C$3<56,\"\",IF(C$7<56,IF(C$4+C$7>=56,\"3rd in group\",\"Group stage\"),\"1/32 final\"))","v":""}]
[{"$f":"IF(C$3<57,\"\",IF(C$7<57,IF(C$4+C$7>=57,C$7+1,C$7+C$4+1),33))","v":""},null,null,null,{"$f":"IF(C$3<57,\"\",IF(C$7<57,IF(C$4+C$7>=57,\"3rd in group\",\"Group stage\"),\"1/32 final\"))","v":""}]
[{"$f":"IF(C$3<58,\"\",IF(C$7<58,IF(C$4+C$7>=58,C$7+1,C$7+C$4+1),33))","v":""},null,null,null,{"$f":"IF(C$3<58,\"\",IF(C$7<58,IF(C$4+C$7>=58,\"3rd in group\",\"Group stage\"),\"1/32 final\"))","v":""}]
[{"$f":"IF(C$3<59,\"\",IF(C$7<59,IF(C$4+C$7>=59,C$7+1,C$7+C$4+1),33))","v":""},null,null,null,{"$f":"IF(C$3<59,\"\",IF(C$7<59,IF(C$4+C$7>=59,\"3rd in group\",\"Group stage\"),\"1/32 final\"))","v":""}]
[{"$f":"IF(C$3<60,\"\",IF(C$7<60,IF(C$4+C$7>=60,C$7+1,C$7+C$4+1),33))","v":""},null,null,null,{"$f":"IF(C$3<60,\"\",IF(C$7<60,IF(C$4+C$7>=60,\"3rd in group\",\"Group stage\"),\"1/32 final\"))","v":""}]
[{"$f":"IF(C$3<61,\"\",IF(C$7<61,IF(C$4+C$7>=61,C$7+1,C$7+C$4+1),33))","v":""},null,null,null,{"$f":"IF(C$3<61,\"\",IF(C$7<61,IF(C$4+C$7>=61,\"3rd in group\",\"Group stage\"),\"1/32 final\"))","v":""}]
[{"$f":"IF(C$3<62,\"\",IF(C$7<62,IF(C$4+C$7>=62,C$7+1,C$7+C$4+1),33))","v":""},null,null,null,{"$f":"IF(C$3<62,\"\",IF(C$7<62,IF(C$4+C$7>=62,\"3rd in group\",\"Group stage\"),\"1/32 final\"))","v":""}]
[{"$f":"IF(C$3<63,\"\",IF(C$7<63,IF(C$4+C$7>=63,C$7+1,C$7+C$4+1),33))","v":""},null,null,null,{"$f":"IF(C$3<63,\"\",IF(C$7<63,IF(C$4+C$7>=63,\"3rd in group\",\"Group stage\"),\"1/32 final\"))","v":""}]
[{"$f":"IF(C$3<64,\"\",IF(C$7<64,IF(C$4+C$7>=64,C$7+1,C$7+C$4+1),33))","v":""},null,null,null,{"$f":"IF(C$3<64,\"\",IF(C$7<64,IF(C$4+C$7>=64,\"3rd in group\",\"Group stage\"),\"1/32 final\"))","v":""}]

{"sheet":"Female U12","index":11,"n_rows":73,"n_cols":5,"rows_kept":73,"cut":false,"hidden":false,"merged":[[0,0,0,4]]}
["Female singles: Juniors U12"]
[]
[null,"Number of players:",16]
[null,"Number of groups :",{"$f":"IF(C3<6,1,IF(C3<11,2,IF(C3=11,3,INT(C3/4))))","v":4}]
[null,"Tournament scheme:",{"$f":"CONCATENATE(IF(C3<6,CONCATENATE(\"1*\",C3),\"\"),IF(C3=6,\"2*3\",\"\"),IF(C3=7,\"1*4 + 1*3\",\"\"),IF(C3=11,\"2*4 + 1*3\",\"\"),IF(OR(C3=15,C3=10),CONCATENATE(C3/5,\"*5\"),\"\"),IF(OR(C3<=7,C3=10,C3=11,C3=15),\"\",CONCATENATE(INT(C3/4)-MOD(C3,4),\"*4\",IF(MOD(C3,4)=0,\"\",CONCATENATE(\" + \",MOD(C3,4),\"*5\")))))","v":"4*4"}]
[null,"Qualification:",{"$f":"IF(C3>=6,\"2 players per group\",\"NA\")","v":"2 players per group"}]
[null,"Nb of qualified players :",{"$f":"IF(C3<6,\"NA\",IF(C3<11,4,IF(C3=11,6,INT(C3/4)*2)))","v":8}]
[]
["Rank","Family name","First-name","Country","Reached stage"]
[1,null,null,null,{"$f":"IF(C$3<6,\"Group stage\",\"Final\")","v":"Final"}]
[2,null,null,null,"Final"]
[3,null,null,null,{"$f":"IF(C$3<6,\"Group stage\",\"1/2 final\")","v":"1/2 final"}]
[{"$f":"IF(C$3<6,4,3)","v":3},null,null,null,"1/2 final"]
[{"$f":"IF(C$3<5,\"\",5)","v":5},null,null,null,{"$f":"IF(C$3<5,\"\",IF(C$3=5,\"Group stage\",IF(C$7<5,\"3rd in group\",\"1/4 final\")))","v":"1/4 final"}]
[{"$f":"IF(C$3<6,\"\",5)","v":5},null,null,null,{"$f":"IF(C$3<6,\"\",IF(C$7<6,\"3rd in group\",\"1/4 final\"))","v":"1/4 final"}]
[{"$f":"IF(C$3<7,\"\",IF(C$7<7,IF(C$4+C$7>=7,C$7+1,C$7+C$4+1),5))","v":5},null,null,null,{"$f":"IF(C$3<7,\"\",IF(C$7<7,IF(C$4+C$7>=7,\"3rd in group\",\"Group stage\"),\"1/4 final\"))","v":"1/4 final"}]
[{"$f":"IF(C$3<8,\"\",IF(C$7<8,IF(C$4+C$7>=8,C$7+1,C$7+C$4+1),5))","v":5},null,null,null,{"$f":"IF(C$3<8,\"\",IF(C$7<8,IF(C$4+C$7>=8,\"3rd in group\",\"Group stage\"),\"1/4 final\"))","v":"1/4 final"}]
[{"$f":"IF(C$3<9,\"\",IF(C$7<9,IF(C$4+C$7>=9,C$7+1,C$7+C$4+1),9))","v":9},null,null,null,{"$f":"IF(C$3<9,\"\",IF(C$7<9,IF(C$4+C$7>=9,\"3rd in group\",\"Group stage\"),\"1/8 final\"))","v":"3rd in group"}]
[{"$f":"IF(C$3<10,\"\",IF(C$7<10,IF(C$4+C$7>=10,C$7+1,C$7+C$4+1),9))","v":9},null,null,null,{"$f":"IF(C$3<10,\"\",IF(C$7<10,IF(C$4+C$7>=10,\"3rd in group\",\"Group stage\"),\"1/8 final\"))","v":"3rd in group"}]
[{"$f":"IF(C$3<11,\"\",IF(C$7<11,IF(C$4+C$7>=11,C$7+1,C$7+C$4+1),9))","v":9},null,null,null,{"$f":"IF(C$3<11,\"\",IF(C$7<11,IF(C$4+C$7>=11,\"3rd in group\",\"Group stage\"),\"1/8 final\"))","v":"3rd in group"}]
[{"$f":"IF(C$3<12,\"\",IF(C$7<12,IF(C$4+C$7>=12,C$7+1,C$7+C$4+1),9))","v":9},null,null,null,{"$f":"IF(C$3<12,\"\",IF(C$7<12,IF(C$4+C$7>=12,\"3rd in group\",\"Group stage\"),\"1/8 final\"))","v":"3rd in group"}]
[{"$f":"IF(C$3<13,\"\",IF(C$7<13,IF(C$4+C$7>=13,C$7+1,C$7+C$4+1),9))","v":13},null,null,null,{"$f":"IF(C$3<13,\"\",IF(C$7<13,IF(C$4+C$7>=13,\"3rd in group\",\"Group stage\"),\"1/8 final\"))","v":"Group stage"}]
[{"$f":"IF(C$3<14,\"\",IF(C$7<14,IF(C$4+C$7>=14,C$7+1,C$7+C$4+1),9))","v":13},null,null,null,{"$f":"IF(C$3<14,\"\",IF(C$7<14,IF(C$4+C$7>=14,\"3rd in group\",\"Group stage\"),\"1/8 final\"))","v":"Group stage"}]
[{"$f":"IF(C$3<15,\"\",IF(C$7<15,IF(C$4+C$7>=15,C$7+1,C$7+C$4+1),9))","v":13},null,null,null,{"$f":"IF(C$3<15,\"\",IF(C$7<15,IF(C$4+C$7>=15,\"3rd in group\",\"Group stage\"),\"1/8 final\"))","v":"Group stage"}]
[{"$f":"IF(C$3<16,\"\",IF(C$7<16,IF(C$4+C$7>=16,C$7+1,C$7+C$4+1),9))","v":13},null,null,null,{"$f":"IF(C$3<16,\"\",IF(C$7<16,IF(C$4+C$7>=16,\"3rd in group\",\"Group stage\"),\"1/8 final\"))","v":"Group stage"}]
[{"$f":"IF(C$3<17,\"\",IF(C$7<17,IF(C$4+C$7>=17,C$7+1,C$7+C$4+1),17))","v":""},null,null,null,{"$f":"IF(C$3<17,\"\",IF(C$7<17,IF(C$4+C$7>=17,\"3rd in group\",\"Group stage\"),\"1/16 final\"))","v":""}]
[{"$f":"IF(C$3<18,\"\",IF(C$7<18,IF(C$4+C$7>=18,C$7+1,C$7+C$4+1),17))","v":""},null,null,null,{"$f":"IF(C$3<18,\"\",IF(C$7<18,IF(C$4+C$7>=18,\"3rd in group\",\"Group stage\"),\"1/16 final\"))","v":""}]
[{"$f":"IF(C$3<19,\"\",IF(C$7<19,IF(C$4+C$7>=19,C$7+1,C$7+C$4+1),17))","v":""},null,null,null,{"$f":"IF(C$3<19,\"\",IF(C$7<19,IF(C$4+C$7>=19,\"3rd in group\",\"Group stage\"),\"1/16 final\"))","v":""}]
[{"$f":"IF(C$3<20,\"\",IF(C$7<20,IF(C$4+C$7>=20,C$7+1,C$7+C$4+1),17))","v":""},null,null,null,{"$f":"IF(C$3<20,\"\",IF(C$7<20,IF(C$4+C$7>=20,\"3rd in group\",\"Group stage\"),\"1/16 final\"))","v":""}]
[{"$f":"IF(C$3<21,\"\",IF(C$7<21,IF(C$4+C$7>=21,C$7+1,C$7+C$4+1),17))","v":""},null,null,null,{"$f":"IF(C$3<21,\"\",IF(C$7<21,IF(C$4+C$7>=21,\"3rd in group\",\"Group stage\"),\"1/16 final\"))","v":""}]
[{"$f":"IF(C$3<22,\"\",IF(C$7<22,IF(C$4+C$7>=22,C$7+1,C$7+C$4+1),17))","v":""},null,null,null,{"$f":"IF(C$3<22,\"\",IF(C$7<22,IF(C$4+C$7>=22,\"3rd in group\",\"Group stage\"),\"1/16 final\"))","v":""}]
[{"$f":"IF(C$3<23,\"\",IF(C$7<23,IF(C$4+C$7>=23,C$7+1,C$7+C$4+1),17))","v":""},null,null,null,{"$f":"IF(C$3<23,\"\",IF(C$7<23,IF(C$4+C$7>=23,\"3rd in group\",\"Group stage\"),\"1/16 final\"))","v":""}]
[{"$f":"IF(C$3<24,\"\",IF(C$7<24,IF(C$4+C$7>=24,C$7+1,C$7+C$4+1),17))","v":""},null,null,null,{"$f":"IF(C$3<24,\"\",IF(C$7<24,IF(C$4+C$7>=24,\"3rd in group\",\"Group stage\"),\"1/16 final\"))","v":""}]
[{"$f":"IF(C$3<25,\"\",IF(C$7<25,IF(C$4+C$7>=25,C$7+1,C$7+C$4+1),17))","v":""},null,null,null,{"$f":"IF(C$3<25,\"\",IF(C$7<25,IF(C$4+C$7>=25,\"3rd in group\",\"Group stage\"),\"1/16 final\"))","v":""}]
[{"$f":"IF(C$3<26,\"\",IF(C$7<26,IF(C$4+C$7>=26,C$7+1,C$7+C$4+1),17))","v":""},null,null,null,{"$f":"IF(C$3<26,\"\",IF(C$7<26,IF(C$4+C$7>=26,\"3rd in group\",\"Group stage\"),\"1/16 final\"))","v":""}]
[{"$f":"IF(C$3<27,\"\",IF(C$7<27,IF(C$4+C$7>=27,C$7+1,C$7+C$4+1),17))","v":""},null,null,null,{"$f":"IF(C$3<27,\"\",IF(C$7<27,IF(C$4+C$7>=27,\"3rd in group\",\"Group stage\"),\"1/16 final\"))","v":""}]
[{"$f":"IF(C$3<28,\"\",IF(C$7<28,IF(C$4+C$7>=28,C$7+1,C$7+C$4+1),17))","v":""},null,null,null,{"$f":"IF(C$3<28,\"\",IF(C$7<28,IF(C$4+C$7>=28,\"3rd in group\",\"Group stage\"),\"1/16 final\"))","v":""}]
[{"$f":"IF(C$3<29,\"\",IF(C$7<29,IF(C$4+C$7>=29,C$7+1,C$7+C$4+1),17))","v":""},null,null,null,{"$f":"IF(C$3<29,\"\",IF(C$7<29,IF(C$4+C$7>=29,\"3rd in group\",\"Group stage\"),\"1/16 final\"))","v":""}]
[{"$f":"IF(C$3<30,\"\",IF(C$7<30,IF(C$4+C$7>=30,C$7+1,C$7+C$4+1),17))","v":""},null,null,null,{"$f":"IF(C$3<30,\"\",IF(C$7<30,IF(C$4+C$7>=30,\"3rd in group\",\"Group stage\"),\"1/16 final\"))","v":""}]
[{"$f":"IF(C$3<31,\"\",IF(C$7<31,IF(C$4+C$7>=31,C$7+1,C$7+C$4+1),17))","v":""},null,null,null,{"$f":"IF(C$3<31,\"\",IF(C$7<31,IF(C$4+C$7>=31,\"3rd in group\",\"Group stage\"),\"1/16 final\"))","v":""}]
[{"$f":"IF(C$3<32,\"\",IF(C$7<32,IF(C$4+C$7>=32,C$7+1,C$7+C$4+1),17))","v":""},null,null,null,{"$f":"IF(C$3<32,\"\",IF(C$7<32,IF(C$4+C$7>=32,\"3rd in group\",\"Group stage\"),\"1/16 final\"))","v":""}]
[{"$f":"IF(C$3<33,\"\",IF(C$7<33,IF(C$4+C$7>=33,C$7+1,C$7+C$4+1),33))","v":""},null,null,null,{"$f":"IF(C$3<33,\"\",IF(C$7<33,IF(C$4+C$7>=33,\"3rd in group\",\"Group stage\"),\"1/32 final\"))","v":""}]
[{"$f":"IF(C$3<34,\"\",IF(C$7<34,IF(C$4+C$7>=34,C$7+1,C$7+C$4+1),33))","v":""},null,null,null,{"$f":"IF(C$3<34,\"\",IF(C$7<34,IF(C$4+C$7>=34,\"3rd in group\",\"Group stage\"),\"1/32 final\"))","v":""}]
[{"$f":"IF(C$3<35,\"\",IF(C$7<35,IF(C$4+C$7>=35,C$7+1,C$7+C$4+1),33))","v":""},null,null,null,{"$f":"IF(C$3<35,\"\",IF(C$7<35,IF(C$4+C$7>=35,\"3rd in group\",\"Group stage\"),\"1/32 final\"))","v":""}]
[{"$f":"IF(C$3<36,\"\",IF(C$7<36,IF(C$4+C$7>=36,C$7+1,C$7+C$4+1),33))","v":""},null,null,null,{"$f":"IF(C$3<36,\"\",IF(C$7<36,IF(C$4+C$7>=36,\"3rd in group\",\"Group stage\"),\"1/32 final\"))","v":""}]
[{"$f":"IF(C$3<37,\"\",IF(C$7<37,IF(C$4+C$7>=37,C$7+1,C$7+C$4+1),33))","v":""},null,null,null,{"$f":"IF(C$3<37,\"\",IF(C$7<37,IF(C$4+C$7>=37,\"3rd in group\",\"Group stage\"),\"1/32 final\"))","v":""}]
[{"$f":"IF(C$3<38,\"\",IF(C$7<38,IF(C$4+C$7>=38,C$7+1,C$7+C$4+1),33))","v":""},null,null,null,{"$f":"IF(C$3<38,\"\",IF(C$7<38,IF(C$4+C$7>=38,\"3rd in group\",\"Group stage\"),\"1/32 final\"))","v":""}]
[{"$f":"IF(C$3<39,\"\",IF(C$7<39,IF(C$4+C$7>=39,C$7+1,C$7+C$4+1),33))","v":""},null,null,null,{"$f":"IF(C$3<39,\"\",IF(C$7<39,IF(C$4+C$7>=39,\"3rd in group\",\"Group stage\"),\"1/32 final\"))","v":""}]
[{"$f":"IF(C$3<40,\"\",IF(C$7<40,IF(C$4+C$7>=40,C$7+1,C$7+C$4+1),33))","v":""},null,null,null,{"$f":"IF(C$3<40,\"\",IF(C$7<40,IF(C$4+C$7>=40,\"3rd in group\",\"Group stage\"),\"1/32 final\"))","v":""}]
[{"$f":"IF(C$3<41,\"\",IF(C$7<41,IF(C$4+C$7>=41,C$7+1,C$7+C$4+1),33))","v":""},null,null,null,{"$f":"IF(C$3<41,\"\",IF(C$7<41,IF(C$4+C$7>=41,\"3rd in group\",\"Group stage\"),\"1/32 final\"))","v":""}]
[{"$f":"IF(C$3<42,\"\",IF(C$7<42,IF(C$4+C$7>=42,C$7+1,C$7+C$4+1),33))","v":""},null,null,null,{"$f":"IF(C$3<42,\"\",IF(C$7<42,IF(C$4+C$7>=42,\"3rd in group\",\"Group stage\"),\"1/32 final\"))","v":""}]
[{"$f":"IF(C$3<43,\"\",IF(C$7<43,IF(C$4+C$7>=43,C$7+1,C$7+C$4+1),33))","v":""},null,null,null,{"$f":"IF(C$3<43,\"\",IF(C$7<43,IF(C$4+C$7>=43,\"3rd in group\",\"Group stage\"),\"1/32 final\"))","v":""}]
[{"$f":"IF(C$3<44,\"\",IF(C$7<44,IF(C$4+C$7>=44,C$7+1,C$7+C$4+1),33))","v":""},null,null,null,{"$f":"IF(C$3<44,\"\",IF(C$7<44,IF(C$4+C$7>=44,\"3rd in group\",\"Group stage\"),\"1/32 final\"))","v":""}]
[{"$f":"IF(C$3<45,\"\",IF(C$7<45,IF(C$4+C$7>=45,C$7+1,C$7+C$4+1),33))","v":""},null,null,null,{"$f":"IF(C$3<45,\"\",IF(C$7<45,IF(C$4+C$7>=45,\"3rd in group\",\"Group stage\"),\"1/32 final\"))","v":""}]
[{"$f":"IF(C$3<46,\"\",IF(C$7<46,IF(C$4+C$7>=46,C$7+1,C$7+C$4+1),33))","v":""},null,null,null,{"$f":"IF(C$3<46,\"\",IF(C$7<46,IF(C$4+C$7>=46,\"3rd in group\",\"Group stage\"),\"1/32 final\"))","v":""}]
[{"$f":"IF(C$3<47,\"\",IF(C$7<47,IF(C$4+C$7>=47,C$7+1,C$7+C$4+1),33))","v":""},null,null,null,{"$f":"IF(C$3<47,\"\",IF(C$7<47,IF(C$4+C$7>=47,\"3rd in group\",\"Group stage\"),\"1/32 final\"))","v":""}]
[{"$f":"IF(C$3<48,\"\",IF(C$7<48,IF(C$4+C$7>=48,C$7+1,C$7+C$4+1),33))","v":""},null,null,null,{"$f":"IF(C$3<48,\"\",IF(C$7<48,IF(C$4+C$7>=48,\"3rd in group\",\"Group stage\"),\"1/32 final\"))","v":""}]
[{"$f":"IF(C$3<49,\"\",IF(C$7<49,IF(C$4+C$7>=49,C$7+1,C$7+C$4+1),33))","v":""},null,null,null,{"$f":"IF(C$3<49,\"\",IF(C$7<49,IF(C$4+C$7>=49,\"3rd in group\",\"Group stage\"),\"1/32 final\"))","v":""}]
[{"$f":"IF(C$3<50,\"\",IF(C$7<50,IF(C$4+C$7>=50,C$7+1,C$7+C$4+1),33))","v":""},null,null,null,{"$f":"IF(C$3<50,\"\",IF(C$7<50,IF(C$4+C$7>=50,\"3rd in group\",\"Group stage\"),\"1/32 final\"))","v":""}]
[{"$f":"IF(C$3<51,\"\",IF(C$7<51,IF(C$4+C$7>=51,C$7+1,C$7+C$4+1),33))","v":""},null,null,null,{"$f":"IF(C$3<51,\"\",IF(C$7<51,IF(C$4+C$7>=51,\"3rd in group\",\"Group stage\"),\"1/32 final\"))","v":""}]
[{"$f":"IF(C$3<52,\"\",IF(C$7<52,IF(C$4+C$7>=52,C$7+1,C$7+C$4+1),33))","v":""},null,null,null,{"$f":"IF(C$3<52,\"\",IF(C$7<52,IF(C$4+C$7>=52,\"3rd in group\",\"Group stage\"),\"1/32 final\"))","v":""}]
[{"$f":"IF(C$3<53,\"\",IF(C$7<53,IF(C$4+C$7>=53,C$7+1,C$7+C$4+1),33))","v":""},null,null,null,{"$f":"IF(C$3<53,\"\",IF(C$7<53,IF(C$4+C$7>=53,\"3rd in group\",\"Group stage\"),\"1/32 final\"))","v":""}]
[{"$f":"IF(C$3<54,\"\",IF(C$7<54,IF(C$4+C$7>=54,C$7+1,C$7+C$4+1),33))","v":""},null,null,null,{"$f":"IF(C$3<54,\"\",IF(C$7<54,IF(C$4+C$7>=54,\"3rd in group\",\"Group stage\"),\"1/32 final\"))","v":""}]
[{"$f":"IF(C$3<55,\"\",IF(C$7<55,IF(C$4+C$7>=55,C$7+1,C$7+C$4+1),33))","v":""},null,null,null,{"$f":"IF(C$3<55,\"\",IF(C$7<55,IF(C$4+C$7>=55,\"3rd in group\",\"Group stage\"),\"1/32 final\"))","v":""}]
[{"$f":"IF(C$3<56,\"\",IF(C$7<56,IF(C$4+C$7>=56,C$7+1,C$7+C$4+1),33))","v":""},null,null,null,{"$f":"IF(C$3<56,\"\",IF(C$7<56,IF(C$4+C$7>=56,\"3rd in group\",\"Group stage\"),\"1/32 final\"))","v":""}]
[{"$f":"IF(C$3<57,\"\",IF(C$7<57,IF(C$4+C$7>=57,C$7+1,C$7+C$4+1),33))","v":""},null,null,null,{"$f":"IF(C$3<57,\"\",IF(C$7<57,IF(C$4+C$7>=57,\"3rd in group\",\"Group stage\"),\"1/32 final\"))","v":""}]
[{"$f":"IF(C$3<58,\"\",IF(C$7<58,IF(C$4+C$7>=58,C$7+1,C$7+C$4+1),33))","v":""},null,null,null,{"$f":"IF(C$3<58,\"\",IF(C$7<58,IF(C$4+C$7>=58,\"3rd in group\",\"Group stage\"),\"1/32 final\"))","v":""}]
[{"$f":"IF(C$3<59,\"\",IF(C$7<59,IF(C$4+C$7>=59,C$7+1,C$7+C$4+1),33))","v":""},null,null,null,{"$f":"IF(C$3<59,\"\",IF(C$7<59,IF(C$4+C$7>=59,\"3rd in group\",\"Group stage\"),\"1/32 final\"))","v":""}]
[{"$f":"IF(C$3<60,\"\",IF(C$7<60,IF(C$4+C$7>=60,C$7+1,C$7+C$4+1),33))","v":""},null,null,null,{"$f":"IF(C$3<60,\"\",IF(C$7<60,IF(C$4+C$7>=60,\"3rd in group\",\"Group stage\"),\"1/32 final\"))","v":""}]
[{"$f":"IF(C$3<61,\"\",IF(C$7<61,IF(C$4+C$7>=61,C$7+1,C$7+C$4+1),33))","v":""},null,null,null,{"$f":"IF(C$3<61,\"\",IF(C$7<61,IF(C$4+C$7>=61,\"3rd in group\",\"Group stage\"),\"1/32 final\"))","v":""}]
[{"$f":"IF(C$3<62,\"\",IF(C$7<62,IF(C$4+C$7>=62,C$7+1,C$7+C$4+1),33))","v":""},null,null,null,{"$f":"IF(C$3<62,\"\",IF(C$7<62,IF(C$4+C$7>=62,\"3rd in group\",\"Group stage\"),\"1/32 final\"))","v":""}]
[{"$f":"IF(C$3<63,\"\",IF(C$7<63,IF(C$4+C$7>=63,C$7+1,C$7+C$4+1),33))","v":""},null,null,null,{"$f":"IF(C$3<63,\"\",IF(C$7<63,IF(C$4+C$7>=63,\"3rd in group\",\"Group stage\"),\"1/32 final\"))","v":""}]
[{"$f":"IF(C$3<64,\"\",IF(C$7<64,IF(C$4+C$7>=64,C$7+1,C$7+C$4+1),33))","v":""},null,null,null,{"$f":"IF(C$3<64,\"\",IF(C$7<64,IF(C$4+C$7>=64,\"3rd in group\",\"Group stage\"),\"1/32 final\"))","v":""}]

{"sheet":"Male U12","index":12,"n_rows":73,"n_cols":5,"rows_kept":73,"cut":false,"hidden":false,"merged":[[0,0,0,4]]}
["Male singles: Juniors U12"]
[]
[null,"Number of players:",16]
[null,"Number of groups :",{"$f":"IF(C3<6,1,IF(C3<11,2,IF(C3=11,3,INT(C3/4))))","v":4}]
[null,"Tournament scheme:",{"$f":"CONCATENATE(IF(C3<6,CONCATENATE(\"1*\",C3),\"\"),IF(C3=6,\"2*3\",\"\"),IF(C3=7,\"1*4 + 1*3\",\"\"),IF(C3=11,\"2*4 + 1*3\",\"\"),IF(OR(C3=15,C3=10),CONCATENATE(C3/5,\"*5\"),\"\"),IF(OR(C3<=7,C3=10,C3=11,C3=15),\"\",CONCATENATE(INT(C3/4)-MOD(C3,4),\"*4\",IF(MOD(C3,4)=0,\"\",CONCATENATE(\" + \",MOD(C3,4),\"*5\")))))","v":"4*4"}]
[null,"Qualification:",{"$f":"IF(C3>=6,\"2 players per group\",\"NA\")","v":"2 players per group"}]
[null,"Nb of qualified players :",{"$f":"IF(C3<6,\"NA\",IF(C3<11,4,IF(C3=11,6,INT(C3/4)*2)))","v":8}]
[]
["Rank","Family name","First-name","Country","Reached stage"]
[1,null,null,null,{"$f":"IF(C$3<6,\"Group stage\",\"Final\")","v":"Final"}]
[2,null,null,null,"Final"]
[3,null,null,null,{"$f":"IF(C$3<6,\"Group stage\",\"1/2 final\")","v":"1/2 final"}]
[{"$f":"IF(C$3<6,4,3)","v":3},null,null,null,"1/2 final"]
[{"$f":"IF(C$3<5,\"\",5)","v":5},null,null,null,{"$f":"IF(C$3<5,\"\",IF(C$3=5,\"Group stage\",IF(C$7<5,\"3rd in group\",\"1/4 final\")))","v":"1/4 final"}]
[{"$f":"IF(C$3<6,\"\",5)","v":5},null,null,null,{"$f":"IF(C$3<6,\"\",IF(C$7<6,\"3rd in group\",\"1/4 final\"))","v":"1/4 final"}]
[{"$f":"IF(C$3<7,\"\",IF(C$7<7,IF(C$4+C$7>=7,C$7+1,C$7+C$4+1),5))","v":5},null,null,null,{"$f":"IF(C$3<7,\"\",IF(C$7<7,IF(C$4+C$7>=7,\"3rd in group\",\"Group stage\"),\"1/4 final\"))","v":"1/4 final"}]
[{"$f":"IF(C$3<8,\"\",IF(C$7<8,IF(C$4+C$7>=8,C$7+1,C$7+C$4+1),5))","v":5},null,null,null,{"$f":"IF(C$3<8,\"\",IF(C$7<8,IF(C$4+C$7>=8,\"3rd in group\",\"Group stage\"),\"1/4 final\"))","v":"1/4 final"}]
[{"$f":"IF(C$3<9,\"\",IF(C$7<9,IF(C$4+C$7>=9,C$7+1,C$7+C$4+1),9))","v":9},null,null,null,{"$f":"IF(C$3<9,\"\",IF(C$7<9,IF(C$4+C$7>=9,\"3rd in group\",\"Group stage\"),\"1/8 final\"))","v":"3rd in group"}]
[{"$f":"IF(C$3<10,\"\",IF(C$7<10,IF(C$4+C$7>=10,C$7+1,C$7+C$4+1),9))","v":9},null,null,null,{"$f":"IF(C$3<10,\"\",IF(C$7<10,IF(C$4+C$7>=10,\"3rd in group\",\"Group stage\"),\"1/8 final\"))","v":"3rd in group"}]
[{"$f":"IF(C$3<11,\"\",IF(C$7<11,IF(C$4+C$7>=11,C$7+1,C$7+C$4+1),9))","v":9},null,null,null,{"$f":"IF(C$3<11,\"\",IF(C$7<11,IF(C$4+C$7>=11,\"3rd in group\",\"Group stage\"),\"1/8 final\"))","v":"3rd in group"}]
[{"$f":"IF(C$3<12,\"\",IF(C$7<12,IF(C$4+C$7>=12,C$7+1,C$7+C$4+1),9))","v":9},null,null,null,{"$f":"IF(C$3<12,\"\",IF(C$7<12,IF(C$4+C$7>=12,\"3rd in group\",\"Group stage\"),\"1/8 final\"))","v":"3rd in group"}]
[{"$f":"IF(C$3<13,\"\",IF(C$7<13,IF(C$4+C$7>=13,C$7+1,C$7+C$4+1),9))","v":13},null,null,null,{"$f":"IF(C$3<13,\"\",IF(C$7<13,IF(C$4+C$7>=13,\"3rd in group\",\"Group stage\"),\"1/8 final\"))","v":"Group stage"}]
[{"$f":"IF(C$3<14,\"\",IF(C$7<14,IF(C$4+C$7>=14,C$7+1,C$7+C$4+1),9))","v":13},null,null,null,{"$f":"IF(C$3<14,\"\",IF(C$7<14,IF(C$4+C$7>=14,\"3rd in group\",\"Group stage\"),\"1/8 final\"))","v":"Group stage"}]
[{"$f":"IF(C$3<15,\"\",IF(C$7<15,IF(C$4+C$7>=15,C$7+1,C$7+C$4+1),9))","v":13},null,null,null,{"$f":"IF(C$3<15,\"\",IF(C$7<15,IF(C$4+C$7>=15,\"3rd in group\",\"Group stage\"),\"1/8 final\"))","v":"Group stage"}]
[{"$f":"IF(C$3<16,\"\",IF(C$7<16,IF(C$4+C$7>=16,C$7+1,C$7+C$4+1),9))","v":13},null,null,null,{"$f":"IF(C$3<16,\"\",IF(C$7<16,IF(C$4+C$7>=16,\"3rd in group\",\"Group stage\"),\"1/8 final\"))","v":"Group stage"}]
[{"$f":"IF(C$3<17,\"\",IF(C$7<17,IF(C$4+C$7>=17,C$7+1,C$7+C$4+1),17))","v":""},null,null,null,{"$f":"IF(C$3<17,\"\",IF(C$7<17,IF(C$4+C$7>=17,\"3rd in group\",\"Group stage\"),\"1/16 final\"))","v":""}]
[{"$f":"IF(C$3<18,\"\",IF(C$7<18,IF(C$4+C$7>=18,C$7+1,C$7+C$4+1),17))","v":""},null,null,null,{"$f":"IF(C$3<18,\"\",IF(C$7<18,IF(C$4+C$7>=18,\"3rd in group\",\"Group stage\"),\"1/16 final\"))","v":""}]
[{"$f":"IF(C$3<19,\"\",IF(C$7<19,IF(C$4+C$7>=19,C$7+1,C$7+C$4+1),17))","v":""},null,null,null,{"$f":"IF(C$3<19,\"\",IF(C$7<19,IF(C$4+C$7>=19,\"3rd in group\",\"Group stage\"),\"1/16 final\"))","v":""}]
[{"$f":"IF(C$3<20,\"\",IF(C$7<20,IF(C$4+C$7>=20,C$7+1,C$7+C$4+1),17))","v":""},null,null,null,{"$f":"IF(C$3<20,\"\",IF(C$7<20,IF(C$4+C$7>=20,\"3rd in group\",\"Group stage\"),\"1/16 final\"))","v":""}]
[{"$f":"IF(C$3<21,\"\",IF(C$7<21,IF(C$4+C$7>=21,C$7+1,C$7+C$4+1),17))","v":""},null,null,null,{"$f":"IF(C$3<21,\"\",IF(C$7<21,IF(C$4+C$7>=21,\"3rd in group\",\"Group stage\"),\"1/16 final\"))","v":""}]
[{"$f":"IF(C$3<22,\"\",IF(C$7<22,IF(C$4+C$7>=22,C$7+1,C$7+C$4+1),17))","v":""},null,null,null,{"$f":"IF(C$3<22,\"\",IF(C$7<22,IF(C$4+C$7>=22,\"3rd in group\",\"Group stage\"),\"1/16 final\"))","v":""}]
[{"$f":"IF(C$3<23,\"\",IF(C$7<23,IF(C$4+C$7>=23,C$7+1,C$7+C$4+1),17))","v":""},null,null,null,{"$f":"IF(C$3<23,\"\",IF(C$7<23,IF(C$4+C$7>=23,\"3rd in group\",\"Group stage\"),\"1/16 final\"))","v":""}]
[{"$f":"IF(C$3<24,\"\",IF(C$7<24,IF(C$4+C$7>=24,C$7+1,C$7+C$4+1),17))","v":""},null,null,null,{"$f":"IF(C$3<24,\"\",IF(C$7<24,IF(C$4+C$7>=24,\"3rd in group\",\"Group stage\"),\"1/16 final\"))","v":""}]
[{"$f":"IF(C$3<25,\"\",IF(C$7<25,IF(C$4+C$7>=25,C$7+1,C$7+C$4+1),17))","v":""},null,null,null,{"$f":"IF(C$3<25,\"\",IF(C$7<25,IF(C$4+C$7>=25,\"3rd in group\",\"Group stage\"),\"1/16 final\"))","v":""}]
[{"$f":"IF(C$3<26,\"\",IF(C$7<26,IF(C$4+C$7>=26,C$7+1,C$7+C$4+1),17))","v":""},null,null,null,{"$f":"IF(C$3<26,\"\",IF(C$7<26,IF(C$4+C$7>=26,\"3rd in group\",\"Group stage\"),\"1/16 final\"))","v":""}]
[{"$f":"IF(C$3<27,\"\",IF(C$7<27,IF(C$4+C$7>=27,C$7+1,C$7+C$4+1),17))","v":""},null,null,null,{"$f":"IF(C$3<27,\"\",IF(C$7<27,IF(C$4+C$7>=27,\"3rd in group\",\"Group stage\"),\"1/16 final\"))","v":""}]
[{"$f":"IF(C$3<28,\"\",IF(C$7<28,IF(C$4+C$7>=28,C$7+1,C$7+C$4+1),17))","v":""},null,null,null,{"$f":"IF(C$3<28,\"\",IF(C$7<28,IF(C$4+C$7>=28,\"3rd in group\",\"Group stage\"),\"1/16 final\"))","v":""}]
[{"$f":"IF(C$3<29,\"\",IF(C$7<29,IF(C$4+C$7>=29,C$7+1,C$7+C$4+1),17))","v":""},null,null,null,{"$f":"IF(C$3<29,\"\",IF(C$7<29,IF(C$4+C$7>=29,\"3rd in group\",\"Group stage\"),\"1/16 final\"))","v":""}]
[{"$f":"IF(C$3<30,\"\",IF(C$7<30,IF(C$4+C$7>=30,C$7+1,C$7+C$4+1),17))","v":""},null,null,null,{"$f":"IF(C$3<30,\"\",IF(C$7<30,IF(C$4+C$7>=30,\"3rd in group\",\"Group stage\"),\"1/16 final\"))","v":""}]
[{"$f":"IF(C$3<31,\"\",IF(C$7<31,IF(C$4+C$7>=31,C$7+1,C$7+C$4+1),17))","v":""},null,null,null,{"$f":"IF(C$3<31,\"\",IF(C$7<31,IF(C$4+C$7>=31,\"3rd in group\",\"Group stage\"),\"1/16 final\"))","v":""}]
[{"$f":"IF(C$3<32,\"\",IF(C$7<32,IF(C$4+C$7>=32,C$7+1,C$7+C$4+1),17))","v":""},null,null,null,{"$f":"IF(C$3<32,\"\",IF(C$7<32,IF(C$4+C$7>=32,\"3rd in group\",\"Group stage\"),\"1/16 final\"))","v":""}]
[{"$f":"IF(C$3<33,\"\",IF(C$7<33,IF(C$4+C$7>=33,C$7+1,C$7+C$4+1),33))","v":""},null,null,null,{"$f":"IF(C$3<33,\"\",IF(C$7<33,IF(C$4+C$7>=33,\"3rd in group\",\"Group stage\"),\"1/32 final\"))","v":""}]
[{"$f":"IF(C$3<34,\"\",IF(C$7<34,IF(C$4+C$7>=34,C$7+1,C$7+C$4+1),33))","v":""},null,null,null,{"$f":"IF(C$3<34,\"\",IF(C$7<34,IF(C$4+C$7>=34,\"3rd in group\",\"Group stage\"),\"1/32 final\"))","v":""}]
[{"$f":"IF(C$3<35,\"\",IF(C$7<35,IF(C$4+C$7>=35,C$7+1,C$7+C$4+1),33))","v":""},null,null,null,{"$f":"IF(C$3<35,\"\",IF(C$7<35,IF(C$4+C$7>=35,\"3rd in group\",\"Group stage\"),\"1/32 final\"))","v":""}]
[{"$f":"IF(C$3<36,\"\",IF(C$7<36,IF(C$4+C$7>=36,C$7+1,C$7+C$4+1),33))","v":""},null,null,null,{"$f":"IF(C$3<36,\"\",IF(C$7<36,IF(C$4+C$7>=36,\"3rd in group\",\"Group stage\"),\"1/32 final\"))","v":""}]
[{"$f":"IF(C$3<37,\"\",IF(C$7<37,IF(C$4+C$7>=37,C$7+1,C$7+C$4+1),33))","v":""},null,null,null,{"$f":"IF(C$3<37,\"\",IF(C$7<37,IF(C$4+C$7>=37,\"3rd in group\",\"Group stage\"),\"1/32 final\"))","v":""}]
[{"$f":"IF(C$3<38,\"\",IF(C$7<38,IF(C$4+C$7>=38,C$7+1,C$7+C$4+1),33))","v":""},null,null,null,{"$f":"IF(C$3<38,\"\",IF(C$7<38,IF(C$4+C$7>=38,\"3rd in group\",\"Group stage\"),\"1/32 final\"))","v":""}]
[{"$f":"IF(C$3<39,\"\",IF(C$7<39,IF(C$4+C$7>=39,C$7+1,C$7+C$4+1),33))","v":""},null,null,null,{"$f":"IF(C$3<39,\"\",IF(C$7<39,IF(C$4+C$7>=39,\"3rd in group\",\"Group stage\"),\"1/32 final\"))","v":""}]
[{"$f":"IF(C$3<40,\"\",IF(C$7<40,IF(C$4+C$7>=40,C$7+1,C$7+C$4+1),33))","v":""},null,null,null,{"$f":"IF(C$3<40,\"\",IF(C$7<40,IF(C$4+C$7>=40,\"3rd in group\",\"Group stage\"),\"1/32 final\"))","v":""}]
[{"$f":"IF(C$3<41,\"\",IF(C$7<41,IF(C$4+C$7>=41,C$7+1,C$7+C$4+1),33))","v":""},null,null,null,{"$f":"IF(C$3<41,\"\",IF(C$7<41,IF(C$4+C$7>=41,\"3rd in group\",\"Group stage\"),\"1/32 final\"))","v":""}]
[{"$f":"IF(C$3<42,\"\",IF(C$7<42,IF(C$4+C$7>=42,C$7+1,C$7+C$4+1),33))","v":""},null,null,null,{"$f":"IF(C$3<42,\"\",IF(C$7<42,IF(C$4+C$7>=42,\"3rd in group\",\"Group stage\"),\"1/32 final\"))","v":""}]
[{"$f":"IF(C$3<43,\"\",IF(C$7<43,IF(C$4+C$7>=43,C$7+1,C$7+C$4+1),33))","v":""},null,null,null,{"$f":"IF(C$3<43,\"\",IF(C$7<43,IF(C$4+C$7>=43,\"3rd in group\",\"Group stage\"),\"1/32 final\"))","v":""}]
[{"$f":"IF(C$3<44,\"\",IF(C$7<44,IF(C$4+C$7>=44,C$7+1,C$7+C$4+1),33))","v":""},null,null,null,{"$f":"IF(C$3<44,\"\",IF(C$7<44,IF(C$4+C$7>=44,\"3rd in group\",\"Group stage\"),\"1/32 final\"))","v":""}]
[{"$f":"IF(C$3<45,\"\",IF(C$7<45,IF(C$4+C$7>=45,C$7+1,C$7+C$4+1),33))","v":""},null,null,null,{"$f":"IF(C$3<45,\"\",IF(C$7<45,IF(C$4+C$7>=45,\"3rd in group\",\"Group stage\"),\"1/32 final\"))","v":""}]
[{"$f":"IF(C$3<46,\"\",IF(C$7<46,IF(C$4+C$7>=46,C$7+1,C$7+C$4+1),33))","v":""},null,null,null,{"$f":"IF(C$3<46,\"\",IF(C$7<46,IF(C$4+C$7>=46,\"3rd in group\",\"Group stage\"),\"1/32 final\"))","v":""}]
[{"$f":"IF(C$3<47,\"\",IF(C$7<47,IF(C$4+C$7>=47,C$7+1,C$7+C$4+1),33))","v":""},null,null,null,{"$f":"IF(C$3<47,\"\",IF(C$7<47,IF(C$4+C$7>=47,\"3rd in group\",\"Group stage\"),\"1/32 final\"))","v":""}]
[{"$f":"IF(C$3<48,\"\",IF(C$7<48,IF(C$4+C$7>=48,C$7+1,C$7+C$4+1),33))","v":""},null,null,null,{"$f":"IF(C$3<48,\"\",IF(C$7<48,IF(C$4+C$7>=48,\"3rd in group\",\"Group stage\"),\"1/32 final\"))","v":""}]
[{"$f":"IF(C$3<49,\"\",IF(C$7<49,IF(C$4+C$7>=49,C$7+1,C$7+C$4+1),33))","v":""},null,null,null,{"$f":"IF(C$3<49,\"\",IF(C$7<49,IF(C$4+C$7>=49,\"3rd in group\",\"Group stage\"),\"1/32 final\"))","v":""}]
[{"$f":"IF(C$3<50,\"\",IF(C$7<50,IF(C$4+C$7>=50,C$7+1,C$7+C$4+1),33))","v":""},null,null,null,{"$f":"IF(C$3<50,\"\",IF(C$7<50,IF(C$4+C$7>=50,\"3rd in group\",\"Group stage\"),\"1/32 final\"))","v":""}]
[{"$f":"IF(C$3<51,\"\",IF(C$7<51,IF(C$4+C$7>=51,C$7+1,C$7+C$4+1),33))","v":""},null,null,null,{"$f":"IF(C$3<51,\"\",IF(C$7<51,IF(C$4+C$7>=51,\"3rd in group\",\"Group stage\"),\"1/32 final\"))","v":""}]
[{"$f":"IF(C$3<52,\"\",IF(C$7<52,IF(C$4+C$7>=52,C$7+1,C$7+C$4+1),33))","v":""},null,null,null,{"$f":"IF(C$3<52,\"\",IF(C$7<52,IF(C$4+C$7>=52,\"3rd in group\",\"Group stage\"),\"1/32 final\"))","v":""}]
[{"$f":"IF(C$3<53,\"\",IF(C$7<53,IF(C$4+C$7>=53,C$7+1,C$7+C$4+1),33))","v":""},null,null,null,{"$f":"IF(C$3<53,\"\",IF(C$7<53,IF(C$4+C$7>=53,\"3rd in group\",\"Group stage\"),\"1/32 final\"))","v":""}]
[{"$f":"IF(C$3<54,\"\",IF(C$7<54,IF(C$4+C$7>=54,C$7+1,C$7+C$4+1),33))","v":""},null,null,null,{"$f":"IF(C$3<54,\"\",IF(C$7<54,IF(C$4+C$7>=54,\"3rd in group\",\"Group stage\"),\"1/32 final\"))","v":""}]
[{"$f":"IF(C$3<55,\"\",IF(C$7<55,IF(C$4+C$7>=55,C$7+1,C$7+C$4+1),33))","v":""},null,null,null,{"$f":"IF(C$3<55,\"\",IF(C$7<55,IF(C$4+C$7>=55,\"3rd in group\",\"Group stage\"),\"1/32 final\"))","v":""}]
[{"$f":"IF(C$3<56,\"\",IF(C$7<56,IF(C$4+C$7>=56,C$7+1,C$7+C$4+1),33))","v":""},null,null,null,{"$f":"IF(C$3<56,\"\",IF(C$7<56,IF(C$4+C$7>=56,\"3rd in group\",\"Group stage\"),\"1/32 final\"))","v":""}]
[{"$f":"IF(C$3<57,\"\",IF(C$7<57,IF(C$4+C$7>=57,C$7+1,C$7+C$4+1),33))","v":""},null,null,null,{"$f":"IF(C$3<57,\"\",IF(C$7<57,IF(C$4+C$7>=57,\"3rd in group\",\"Group stage\"),\"1/32 final\"))","v":""}]
[{"$f":"IF(C$3<58,\"\",IF(C$7<58,IF(C$4+C$7>=58,C$7+1,C$7+C$4+1),33))","v":""},null,null,null,{"$f":"IF(C$3<58,\"\",IF(C$7<58,IF(C$4+C$7>=58,\"3rd in group\",\"Group stage\"),\"1/32 final\"))","v":""}]
[{"$f":"IF(C$3<59,\"\",IF(C$7<59,IF(C$4+C$7>=59,C$7+1,C$7+C$4+1),33))","v":""},null,null,null,{"$f":"IF(C$3<59,\"\",IF(C$7<59,IF(C$4+C$7>=59,\"3rd in group\",\"Group stage\"),\"1/32 final\"))","v":""}]
[{"$f":"IF(C$3<60,\"\",IF(C$7<60,IF(C$4+C$7>=60,C$7+1,C$7+C$4+1),33))","v":""},null,null,null,{"$f":"IF(C$3<60,\"\",IF(C$7<60,IF(C$4+C$7>=60,\"3rd in group\",\"Group stage\"),\"1/32 final\"))","v":""}]
[{"$f":"IF(C$3<61,\"\",IF(C$7<61,IF(C$4+C$7>=61,C$7+1,C$7+C$4+1),33))","v":""},null,null,null,{"$f":"IF(C$3<61,\"\",IF(C$7<61,IF(C$4+C$7>=61,\"3rd in group\",\"Group stage\"),\"1/32 final\"))","v":""}]
[{"$f":"IF(C$3<62,\"\",IF(C$7<62,IF(C$4+C$7>=62,C$7+1,C$7+C$4+1),33))","v":""},null,null,null,{"$f":"IF(C$3<62,\"\",IF(C$7<62,IF(C$4+C$7>=62,\"3rd in group\",\"Group stage\"),\"1/32 final\"))","v":""}]
[{"$f":"IF(C$3<63,\"\",IF(C$7<63,IF(C$4+C$7>=63,C$7+1,C$7+C$4+1),33))","v":""},null,null,null,{"$f":"IF(C$3<63,\"\",IF(C$7<63,IF(C$4+C$7>=63,\"3rd in group\",\"Group stage\"),\"1/32 final\"))","v":""}]
[{"$f":"IF(C$3<64,\"\",IF(C$7<64,IF(C$4+C$7>=64,C$7+1,C$7+C$4+1),33))","v":""},null,null,null,{"$f":"IF(C$3<64,\"\",IF(C$7<64,IF(C$4+C$7>=64,\"3rd in group\",\"Group stage\"),\"1/32 final\"))","v":""}]

{"sheet":"Open doubles","index":13,"n_rows":137,"n_cols":5,"rows_kept":137,"cut":false,"hidden":false,"merged":[[0,0,0,4]]}
["Open doubles (all genders)"]
[]
[null,"Number of players:","64"]
[null,"Number of pairs :",{"$f":"C3/2","v":32}]
[null,"Tournament scheme:",{"$f":"IF(C4<=5, \"1 group\",\"KO system\")","v":"KO system"}]
[null,"Qualification:","NA"]
[null,"Nb of qualified players :",{"$f":"IF(C4<=5,\"NA\",C4)","v":32}]
[]
["Rank","Family name","First-name","Country","Reached stage"]
[1,null,null,null,{"$f":"IF(C$4<=5,\"Group\",\"Final\")","v":"Final"}]
[1,null,null,null,"Final"]
[2,null,null,null,"Final"]
[2,null,null,null,"Final"]
[3,null,null,null,{"$f":"IF(C$4<=5,\"Group\",\"1/2 final\")","v":"1/2 final"}]
[3,null,null,null,"1/2 final"]
[{"$f":"IF(C4<6,4,3)","v":3},null,null,null,"1/2 final"]
[{"$f":"IF(C4<6,4,3)","v":3},null,null,null,"1/2 final"]
[{"$f":"IF(C$4<INT((ROW(A18)-8)/2),\"\",5)","v":5},null,null,null,{"$f":"IF(C$4<INT((ROW(A18)-8)/2),\"\",IF(C$4<=5,\"Group\",\"1/4 final\"))","v":"1/4 final"}]
[5,null,null,null,"1/4 final"]
[5,null,null,null,{"$f":"IF(C$4<INT((ROW(A20)-8)/2),\"\",\"1/4 final\")","v":"1/4 final"}]
[5,null,null,null,"1/4 final"]
[5,null,null,null,"1/4 final"]
[5,null,null,null,"1/4 final"]
[5,null,null,null,"1/4 final"]
[5,null,null,null,"1/4 final"]
[{"$f":"IF(C$4<INT((ROW(A26)-8)/2),\"\",9)","v":9},null,null,null,{"$f":"IF(C$4<INT((ROW(A26)-8)/2),\"\",\"1/8 final\")","v":"1/8 final"}]
[9,null,null,null,"1/8 final"]
[9,null,null,null,"1/8 final"]
[9,null,null,null,"1/8 final"]
[9,null,null,null,"1/8 final"]
[9,null,null,null,"1/8 final"]
[9,null,null,null,"1/8 final"]
[9,null,null,null,"1/8 final"]
[9,null,null,null,"1/8 final"]
[9,null,null,null,"1/8 final"]
[9,null,null,null,"1/8 final"]
[9,null,null,null,"1/8 final"]
[9,null,null,null,"1/8 final"]
[9,null,null,null,"1/8 final"]
[9,null,null,null,"1/8 final"]
[9,null,null,null,"1/8 final"]
[{"$f":"IF(C$4<INT((ROW(A42)-8)/2),\"\",17)","v":17},null,null,null,{"$f":"IF(C$4<INT((ROW(A42)-8)/2),\"\",\"1/16 final\")","v":"1/16 final"}]
[17,null,null,null,"1/16 final"]
[17,null,null,null,"1/16 final"]
[17,null,null,null,"1/16 final"]
[17,null,null,null,"1/16 final"]
[17,null,null,null,"1/16 final"]
[17,null,null,null,"1/16 final"]
[17,null,null,null,"1/16 final"]
[17,null,null,null,"1/16 final"]
[17,null,null,null,"1/16 final"]
[17,null,null,null,"1/16 final"]
[17,null,null,null,"1/16 final"]
[17,null,null,null,"1/16 final"]
[17,null,null,null,"1/16 final"]
[17,null,null,null,"1/16 final"]
[17,null,null,null,"1/16 final"]
[17,null,null,null,"1/16 final"]
[17,null,null,null,"1/16 final"]
[17,null,null,null,"1/16 final"]
[17,null,null,null,"1/16 final"]
[17,null,null,null,"1/16 final"]
[17,null,null,null,"1/16 final"]
[17,null,null,null,"1/16 final"]
[17,null,null,null,"1/16 final"]
[17,null,null,null,"1/16 final"]
[17,null,null,null,"1/16 final"]
[17,null,null,null,"1/16 final"]
[17,null,null,null,"1/16 final"]
[17,null,null,null,"1/16 final"]
[17,null,null,null,"1/16 final"]
[17,null,null,null,"1/16 final"]
[17,null,null,null,"1/16 final"]
[{"$f":"IF(C$4<INT((ROW(A74)-8)/2),\"\",33)","v":""},null,null,null,{"$f":"IF(C$4<INT((ROW(A74)-8)/2),\"\",\"1/32 final\")","v":""}]
["",null,null,null,""]
["",null,null,null,""]
["",null,null,null,""]
["",null,null,null,""]
["",null,null,null,""]
["",null,null,null,""]
["",null,null,null,""]
["",null,null,null,""]
["",null,null,null,""]
["",null,null,null,""]
["",null,null,null,""]
["",null,null,null,""]
["",null,null,null,""]
["",null,null,null,""]
["",null,null,null,""]
["",null,null,null,""]
["",null,null,null,""]
["",null,null,null,""]
["",null,null,null,""]
["",null,null,null,""]
["",null,null,null,""]
["",null,null,null,""]
["",null,null,null,""]
["",null,null,null,""]
["",null,null,null,""]
["",null,null,null,""]
["",null,null,null,""]
["",null,null,null,""]
["",null,null,null,""]
["",null,null,null,""]
["",null,null,null,""]
["",null,null,null,""]
["",null,null,null,""]
["",null,null,null,""]
["",null,null,null,""]
["",null,null,null,""]
["",null,null,null,""]
["",null,null,null,""]
["",null,null,null,""]
["",null,null,null,""]
["",null,null,null,""]
["",null,null,null,""]
["",null,null,null,""]
["",null,null,null,""]
["",null,null,null,""]
["",null,null,null,""]
["",null,null,null,""]
["",null,null,null,""]
["",null,null,null,""]
["",null,null,null,""]
["",null,null,null,""]
["",null,null,null,""]
["",null,null,null,""]
["",null,null,null,""]
["",null,null,null,""]
["",null,null,null,""]
["",null,null,null,""]
["",null,null,null,""]
["",null,null,null,""]
["",null,null,null,""]
["",null,null,null,""]
["",null,null,null,""]
["",null,null,null,""]

{"sheet":"Mix doubles","index":14,"n_rows":137,"n_cols":5,"rows_kept":137,"cut":false,"hidden":false,"merged":[[0,0,0,4]]}
["Mix doubles (one female and one male)"]
[]
[null,"Number of players:","64"]
[null,"Number of pairs :",{"$f":"C3/2","v":32}]
[null,"Tournament scheme:",{"$f":"IF(C4<=5, \"1 group\",\"KO system\")","v":"KO system"}]
[null,"Qualification:","NA"]
[null,"Nb of qualified players :",{"$f":"IF(C4<=5,\"NA\",C4)","v":32}]
[]
["Rank","Family name","First-name","Country","Reached stage"]
[1,null,null,null,{"$f":"IF(C$4<=5,\"Group\",\"Final\")","v":"Final"}]
[1,null,null,null,"Final"]
[2,null,null,null,"Final"]
[2,null,null,null,"Final"]
[3,null,null,null,{"$f":"IF(C$4<=5,\"Group\",\"1/2 final\")","v":"1/2 final"}]
[3,null,null,null,"1/2 final"]
[{"$f":"IF(C4<6,4,3)","v":3},null,null,null,"1/2 final"]
[{"$f":"IF(C4<6,4,3)","v":3},null,null,null,"1/2 final"]
[{"$f":"IF(C$4<INT((ROW(A18)-8)/2),\"\",5)","v":5},null,null,null,{"$f":"IF(C$4<INT((ROW(A18)-8)/2),\"\",IF(C$4<=5,\"Group\",\"1/4 final\"))","v":"1/4 final"}]
[5,null,null,null,"1/4 final"]
[5,null,null,null,{"$f":"IF(C$4<INT((ROW(A20)-8)/2),\"\",\"1/4 final\")","v":"1/4 final"}]
[5,null,null,null,"1/4 final"]
[5,null,null,null,"1/4 final"]
[5,null,null,null,"1/4 final"]
[5,null,null,null,"1/4 final"]
[5,null,null,null,"1/4 final"]
[{"$f":"IF(C$4<INT((ROW(A26)-8)/2),\"\",9)","v":9},null,null,null,{"$f":"IF(C$4<INT((ROW(A26)-8)/2),\"\",\"1/8 final\")","v":"1/8 final"}]
[9,null,null,null,"1/8 final"]
[9,null,null,null,"1/8 final"]
[9,null,null,null,"1/8 final"]
[9,null,null,null,"1/8 final"]
[9,null,null,null,"1/8 final"]
[9,null,null,null,"1/8 final"]
[9,null,null,null,"1/8 final"]
[9,null,null,null,"1/8 final"]
[9,null,null,null,"1/8 final"]
[9,null,null,null,"1/8 final"]
[9,null,null,null,"1/8 final"]
[9,null,null,null,"1/8 final"]
[9,null,null,null,"1/8 final"]
[9,null,null,null,"1/8 final"]
[9,null,null,null,"1/8 final"]
[{"$f":"IF(C$4<INT((ROW(A42)-8)/2),\"\",17)","v":17},null,null,null,{"$f":"IF(C$4<INT((ROW(A42)-8)/2),\"\",\"1/16 final\")","v":"1/16 final"}]
[17,null,null,null,"1/16 final"]
[17,null,null,null,"1/16 final"]
[17,null,null,null,"1/16 final"]
[17,null,null,null,"1/16 final"]
[17,null,null,null,"1/16 final"]
[17,null,null,null,"1/16 final"]
[17,null,null,null,"1/16 final"]
[17,null,null,null,"1/16 final"]
[17,null,null,null,"1/16 final"]
[17,null,null,null,"1/16 final"]
[17,null,null,null,"1/16 final"]
[17,null,null,null,"1/16 final"]
[17,null,null,null,"1/16 final"]
[17,null,null,null,"1/16 final"]
[17,null,null,null,"1/16 final"]
[17,null,null,null,"1/16 final"]
[17,null,null,null,"1/16 final"]
[17,null,null,null,"1/16 final"]
[17,null,null,null,"1/16 final"]
[17,null,null,null,"1/16 final"]
[17,null,null,null,"1/16 final"]
[17,null,null,null,"1/16 final"]
[17,null,null,null,"1/16 final"]
[17,null,null,null,"1/16 final"]
[17,null,null,null,"1/16 final"]
[17,null,null,null,"1/16 final"]
[17,null,null,null,"1/16 final"]
[17,null,null,null,"1/16 final"]
[17,null,null,null,"1/16 final"]
[17,null,null,null,"1/16 final"]
[17,null,null,null,"1/16 final"]
[{"$f":"IF(C$4<INT((ROW(A74)-8)/2),\"\",33)","v":""},null,null,null,{"$f":"IF(C$4<INT((ROW(A74)-8)/2),\"\",\"1/32 final\")","v":""}]
["",null,null,null,""]
["",null,null,null,""]
["",null,null,null,""]
["",null,null,null,""]
["",null,null,null,""]
["",null,null,null,""]
["",null,null,null,""]
["",null,null,null,""]
["",null,null,null,""]
["",null,null,null,""]
["",null,null,null,""]
["",null,null,null,""]
["",null,null,null,""]
["",null,null,null,""]
["",null,null,null,""]
["",null,null,null,""]
["",null,null,null,""]
["",null,null,null,""]
["",null,null,null,""]
["",null,null,null,""]
["",null,null,null,""]
["",null,null,null,""]
["",null,null,null,""]
["",null,null,null,""]
["",null,null,null,""]
["",null,null,null,""]
["",null,null,null,""]
["",null,null,null,""]
["",null,null,null,""]
["",null,null,null,""]
["",null,null,null,""]
["",null,null,null,""]
["",null,null,null,""]
["",null,null,null,""]
["",null,null,null,""]
["",null,null,null,""]
["",null,null,null,""]
["",null,null,null,""]
["",null,null,null,""]
["",null,null,null,""]
["",null,null,null,""]
["",null,null,null,""]
["",null,null,null,""]
["",null,null,null,""]
["",null,null,null,""]
["",null,null,null,""]
["",null,null,null,""]
["",null,null,null,""]
["",null,null,null,""]
["",null,null,null,""]
["",null,null,null,""]
["",null,null,null,""]
["",null,null,null,""]
["",null,null,null,""]
["",null,null,null,""]
["",null,null,null,""]
["",null,null,null,""]
["",null,null,null,""]
["",null,null,null,""]
["",null,null,null,""]
["",null,null,null,""]
["",null,null,null,""]
["",null,null,null,""]

{"sheet":"Female doubles","index":15,"n_rows":137,"n_cols":5,"rows_kept":137,"cut":false,"hidden":false,"merged":[[0,0,0,4]]}
["Female doubles"]
[]
[null,"Number of players:","64"]
[null,"Number of pairs :",{"$f":"C3/2","v":32}]
[null,"Tournament scheme:",{"$f":"IF(C4<=5, \"1 group\",\"KO system\")","v":"KO system"}]
[null,"Qualification:","NA"]
[null,"Nb of qualified players :",{"$f":"IF(C4<=5,\"NA\",C4)","v":32}]
[]
["Rank","Family name","First-name","Country","Reached stage"]
[1,null,null,null,{"$f":"IF(C$4<=5,\"Group\",\"Final\")","v":"Final"}]
[1,null,null,null,"Final"]
[2,null,null,null,"Final"]
[2,null,null,null,"Final"]
[3,null,null,null,{"$f":"IF(C$4<=5,\"Group\",\"1/2 final\")","v":"1/2 final"}]
[3,null,null,null,"1/2 final"]
[{"$f":"IF(C4<6,4,3)","v":3},null,null,null,"1/2 final"]
[{"$f":"IF(C4<6,4,3)","v":3},null,null,null,"1/2 final"]
[{"$f":"IF(C$4<INT((ROW(A18)-8)/2),\"\",5)","v":5},null,null,null,{"$f":"IF(C$4<INT((ROW(A18)-8)/2),\"\",IF(C$4<=5,\"Group\",\"1/4 final\"))","v":"1/4 final"}]
[5,null,null,null,"1/4 final"]
[5,null,null,null,{"$f":"IF(C$4<INT((ROW(A20)-8)/2),\"\",\"1/4 final\")","v":"1/4 final"}]
[5,null,null,null,"1/4 final"]
[5,null,null,null,"1/4 final"]
[5,null,null,null,"1/4 final"]
[5,null,null,null,"1/4 final"]
[5,null,null,null,"1/4 final"]
[{"$f":"IF(C$4<INT((ROW(A26)-8)/2),\"\",9)","v":9},null,null,null,{"$f":"IF(C$4<INT((ROW(A26)-8)/2),\"\",\"1/8 final\")","v":"1/8 final"}]
[9,null,null,null,"1/8 final"]
[9,null,null,null,"1/8 final"]
[9,null,null,null,"1/8 final"]
[9,null,null,null,"1/8 final"]
[9,null,null,null,"1/8 final"]
[9,null,null,null,"1/8 final"]
[9,null,null,null,"1/8 final"]
[9,null,null,null,"1/8 final"]
[9,null,null,null,"1/8 final"]
[9,null,null,null,"1/8 final"]
[9,null,null,null,"1/8 final"]
[9,null,null,null,"1/8 final"]
[9,null,null,null,"1/8 final"]
[9,null,null,null,"1/8 final"]
[9,null,null,null,"1/8 final"]
[{"$f":"IF(C$4<INT((ROW(A42)-8)/2),\"\",17)","v":17},null,null,null,{"$f":"IF(C$4<INT((ROW(A42)-8)/2),\"\",\"1/16 final\")","v":"1/16 final"}]
[17,null,null,null,"1/16 final"]
[17,null,null,null,"1/16 final"]
[17,null,null,null,"1/16 final"]
[17,null,null,null,"1/16 final"]
[17,null,null,null,"1/16 final"]
[17,null,null,null,"1/16 final"]
[17,null,null,null,"1/16 final"]
[17,null,null,null,"1/16 final"]
[17,null,null,null,"1/16 final"]
[17,null,null,null,"1/16 final"]
[17,null,null,null,"1/16 final"]
[17,null,null,null,"1/16 final"]
[17,null,null,null,"1/16 final"]
[17,null,null,null,"1/16 final"]
[17,null,null,null,"1/16 final"]
[17,null,null,null,"1/16 final"]
[17,null,null,null,"1/16 final"]
[17,null,null,null,"1/16 final"]
[17,null,null,null,"1/16 final"]
[17,null,null,null,"1/16 final"]
[17,null,null,null,"1/16 final"]
[17,null,null,null,"1/16 final"]
[17,null,null,null,"1/16 final"]
[17,null,null,null,"1/16 final"]
[17,null,null,null,"1/16 final"]
[17,null,null,null,"1/16 final"]
[17,null,null,null,"1/16 final"]
[17,null,null,null,"1/16 final"]
[17,null,null,null,"1/16 final"]
[17,null,null,null,"1/16 final"]
[17,null,null,null,"1/16 final"]
[{"$f":"IF(C$4<INT((ROW(A74)-8)/2),\"\",33)","v":""},null,null,null,{"$f":"IF(C$4<INT((ROW(A74)-8)/2),\"\",\"1/32 final\")","v":""}]
["",null,null,null,""]
["",null,null,null,""]
["",null,null,null,""]
["",null,null,null,""]
["",null,null,null,""]
["",null,null,null,""]
["",null,null,null,""]
["",null,null,null,""]
["",null,null,null,""]
["",null,null,null,""]
["",null,null,null,""]
["",null,null,null,""]
["",null,null,null,""]
["",null,null,null,""]
["",null,null,null,""]
["",null,null,null,""]
["",null,null,null,""]
["",null,null,null,""]
["",null,null,null,""]
["",null,null,null,""]
["",null,null,null,""]
["",null,null,null,""]
["",null,null,null,""]
["",null,null,null,""]
["",null,null,null,""]
["",null,null,null,""]
["",null,null,null,""]
["",null,null,null,""]
["",null,null,null,""]
["",null,null,null,""]
["",null,null,null,""]
["",null,null,null,""]
["",null,null,null,""]
["",null,null,null,""]
["",null,null,null,""]
["",null,null,null,""]
["",null,null,null,""]
["",null,null,null,""]
["",null,null,null,""]
["",null,null,null,""]
["",null,null,null,""]
["",null,null,null,""]
["",null,null,null,""]
["",null,null,null,""]
["",null,null,null,""]
["",null,null,null,""]
["",null,null,null,""]
["",null,null,null,""]
["",null,null,null,""]
["",null,null,null,""]
["",null,null,null,""]
["",null,null,null,""]
["",null,null,null,""]
["",null,null,null,""]
["",null,null,null,""]
["",null,null,null,""]
["",null,null,null,""]
["",null,null,null,""]
["",null,null,null,""]
["",null,null,null,""]
["",null,null,null,""]
["",null,null,null,""]
["",null,null,null,""]

{"sheet":"Junior doubles","index":16,"n_rows":137,"n_cols":5,"rows_kept":137,"cut":false,"hidden":false,"merged":[[0,0,0,4]]}
["Junior doubles (female and male U18)"]
[]
[null,"Number of players:","64"]
[null,"Number of pairs :",{"$f":"C3/2","v":32}]
[null,"Tournament scheme:",{"$f":"IF(C4<=5, \"1 group\",\"KO system\")","v":"KO system"}]
[null,"Qualification:","NA"]
[null,"Nb of qualified players :",{"$f":"IF(C4<=5,\"NA\",C4)","v":32}]
[]
["Rank","Family name","First-name","Country","Reached stage"]
[1,null,null,null,{"$f":"IF(C$4<=5,\"Group\",\"Final\")","v":"Final"}]
[1,null,null,null,"Final"]
[2,null,null,null,"Final"]
[2,null,null,null,"Final"]
[3,null,null,null,{"$f":"IF(C$4<=5,\"Group\",\"1/2 final\")","v":"1/2 final"}]
[3,null,null,null,"1/2 final"]
[{"$f":"IF(C4<6,4,3)","v":3},null,null,null,"1/2 final"]
[{"$f":"IF(C4<6,4,3)","v":3},null,null,null,"1/2 final"]
[{"$f":"IF(C$4<INT((ROW(A18)-8)/2),\"\",5)","v":5},null,null,null,{"$f":"IF(C$4<INT((ROW(A18)-8)/2),\"\",IF(C$4<=5,\"Group\",\"1/4 final\"))","v":"1/4 final"}]
[5,null,null,null,"1/4 final"]
[5,null,null,null,{"$f":"IF(C$4<INT((ROW(A20)-8)/2),\"\",\"1/4 final\")","v":"1/4 final"}]
[5,null,null,null,"1/4 final"]
[5,null,null,null,"1/4 final"]
[5,null,null,null,"1/4 final"]
[5,null,null,null,"1/4 final"]
[5,null,null,null,"1/4 final"]
[{"$f":"IF(C$4<INT((ROW(A26)-8)/2),\"\",9)","v":9},null,null,null,{"$f":"IF(C$4<INT((ROW(A26)-8)/2),\"\",\"1/8 final\")","v":"1/8 final"}]
[9,null,null,null,"1/8 final"]
[9,null,null,null,"1/8 final"]
[9,null,null,null,"1/8 final"]
[9,null,null,null,"1/8 final"]
[9,null,null,null,"1/8 final"]
[9,null,null,null,"1/8 final"]
[9,null,null,null,"1/8 final"]
[9,null,null,null,"1/8 final"]
[9,null,null,null,"1/8 final"]
[9,null,null,null,"1/8 final"]
[9,null,null,null,"1/8 final"]
[9,null,null,null,"1/8 final"]
[9,null,null,null,"1/8 final"]
[9,null,null,null,"1/8 final"]
[9,null,null,null,"1/8 final"]
[{"$f":"IF(C$4<INT((ROW(A42)-8)/2),\"\",17)","v":17},null,null,null,{"$f":"IF(C$4<INT((ROW(A42)-8)/2),\"\",\"1/16 final\")","v":"1/16 final"}]
[17,null,null,null,"1/16 final"]
[17,null,null,null,"1/16 final"]
[17,null,null,null,"1/16 final"]
[17,null,null,null,"1/16 final"]
[17,null,null,null,"1/16 final"]
[17,null,null,null,"1/16 final"]
[17,null,null,null,"1/16 final"]
[17,null,null,null,"1/16 final"]
[17,null,null,null,"1/16 final"]
[17,null,null,null,"1/16 final"]
[17,null,null,null,"1/16 final"]
[17,null,null,null,"1/16 final"]
[17,null,null,null,"1/16 final"]
[17,null,null,null,"1/16 final"]
[17,null,null,null,"1/16 final"]
[17,null,null,null,"1/16 final"]
[17,null,null,null,"1/16 final"]
[17,null,null,null,"1/16 final"]
[17,null,null,null,"1/16 final"]
[17,null,null,null,"1/16 final"]
[17,null,null,null,"1/16 final"]
[17,null,null,null,"1/16 final"]
[17,null,null,null,"1/16 final"]
[17,null,null,null,"1/16 final"]
[17,null,null,null,"1/16 final"]
[17,null,null,null,"1/16 final"]
[17,null,null,null,"1/16 final"]
[17,null,null,null,"1/16 final"]
[17,null,null,null,"1/16 final"]
[17,null,null,null,"1/16 final"]
[17,null,null,null,"1/16 final"]
[{"$f":"IF(C$4<INT((ROW(A74)-8)/2),\"\",33)","v":""},null,null,null,{"$f":"IF(C$4<INT((ROW(A74)-8)/2),\"\",\"1/32 final\")","v":""}]
["",null,null,null,""]
["",null,null,null,""]
["",null,null,null,""]
["",null,null,null,""]
["",null,null,null,""]
["",null,null,null,""]
["",null,null,null,""]
["",null,null,null,""]
["",null,null,null,""]
["",null,null,null,""]
["",null,null,null,""]
["",null,null,null,""]
["",null,null,null,""]
["",null,null,null,""]
["",null,null,null,""]
["",null,null,null,""]
["",null,null,null,""]
["",null,null,null,""]
["",null,null,null,""]
["",null,null,null,""]
["",null,null,null,""]
["",null,null,null,""]
["",null,null,null,""]
["",null,null,null,""]
["",null,null,null,""]
["",null,null,null,""]
["",null,null,null,""]
["",null,null,null,""]
["",null,null,null,""]
["",null,null,null,""]
["",null,null,null,""]
["",null,null,null,""]
["",null,null,null,""]
["",null,null,null,""]
["",null,null,null,""]
["",null,null,null,""]
["",null,null,null,""]
["",null,null,null,""]
["",null,null,null,""]
["",null,null,null,""]
["",null,null,null,""]
["",null,null,null,""]
["",null,null,null,""]
["",null,null,null,""]
["",null,null,null,""]
["",null,null,null,""]
["",null,null,null,""]
["",null,null,null,""]
["",null,null,null,""]
["",null,null,null,""]
["",null,null,null,""]
["",null,null,null,""]
["",null,null,null,""]
["",null,null,null,""]
["",null,null,null,""]
["",null,null,null,""]
["",null,null,null,""]
["",null,null,null,""]
["",null,null,null,""]
["",null,null,null,""]
["",null,null,null,""]
["",null,null,null,""]
["",null,null,null,""]